0 0.1699737726931219 0.4246871874628259 0.1958893681806648 0.2147497719993127
0 0.500346774469321 0.4535611063871033 0.1502156812991626 0.146174214554154
0 0.7068933362556695 0.4526587964207196 0.1309312357269728 0.1299326351592479
0 0.8068679619851798 0.3931063386393976 0.1014970819588936 0.1263233952937133
0 0.7880910018227845 0.3299446409925409 0.1045419944176605 0.1335418750247827
0 0.971800720168382 0.4716073057147766 0.04770362852068 0.2147497719993126
