0 0.8466764315298856 0.5681332597887114 0.1382720807431083 0.217855605897607
0 0.6831985027346481 0.2516018794551294 0.1195477364758124 0.1845365132309142
0 0.0688959773499011 0.3579666752757259 0.1209880706502198 0.2639897342053356
0 0.922293975686273 0.2772319507372008 0.0936217213364796 0.1384023849231856
