1 0.871162112494811 0.387795217789993 0.2448568096492543 0.7674788514415021
1 0.657992654682519 0.3971547159783041 0.6020596849022843 0.7674788514415021
1 0.233814240319546 0.3353820279354514 0.4421825915430653 0.6439334753557968
