0 0.8171495809545344 0.8594617778469908 0.1454737516151452 0.1922255496507973
0 0.7804210595071461 0.7851345653153494 0.1728401009288854 0.1563434470493151
0 0.8013059050360531 0.6826142721682574 0.0619343694995172 0.0845792418463509
0 0.3627241489290064 0.6326356292590501 0.1440334174407378 0.1332763810912194
0 0.0991429950124561 0.5519008984057152 0.0720167087203689 0.1050833004757691
