1 0.3952123164140065 0.3987658335172291 0.7843962037486452 0.7615352337862507
1 0.2532639417409944 0.0179982166241038 0.0 0.0
1 0.6128664909126254 0.3307465723042767 0.757057998256065 0.6283016293485089
