0 0.3187772925764192 0.7055765595463138 0.3566229985443959 0.4536862003780718
0 0.0611353711790393 0.5713610586011342 0.1149927219796215 0.2079395085066162
0 0.0407569141193595 0.694234404536862 0.074235807860262 0.1701323251417769
