5 0.1914703320527418 0.5307386909637761 0.1172084742939681 0.1231484170781295
5 0.572174193213684 0.6602768843997331 0.212943640320339 0.1707812953819344
5 0.4419922618413759 0.6585342181203258 0.2371011121213858 0.2253848388033691
