0 0.2597402554588788 0.553182402070054 0.1886837768473666 0.2306706595809567
0 0.1142665038437335 0.3622383560835953 0.1195477364758124 0.0999572858184145
0 0.0458506305593831 0.3314822681394677 0.0748973770691836 0.1409654030772513
0 0.6378279762408157 0.4134985026571412 0.0893007188132574 0.0999572858184145
