1 0.0847811892454046 0.337414413690567 0.1681004077545367 0.674828827381134
1 0.6194963380694389 0.3709378528874367 0.7574159055948257 0.7298166179098189
0 0.7202447163515017 0.1257225433526011 0.1790878754171301 0.2514450867052023
