deepstrom -e 200 -s 128 -v 10000 -a 0 -q --cifar10 -d 0.5 -T -m 8 -g '0.01;0.05;0.1;0.5'
deepstrom -e 200 -s 128 -v 10000 -a 0 -q --cifar10 -d 0.5 -T -m 16 -g '0.01;0.05;0.1;0.5'
deepstrom -e 200 -s 128 -v 10000 -a 0 -q --cifar10 -d 0.5 -T -m 32 -g '0.01;0.05;0.1;0.5'
deepstrom -e 200 -s 128 -v 10000 -a 0 -q --cifar10 -d 0.5 -m 8 -g '0.01;0.05;0.1;0.5'
deepstrom -e 200 -s 128 -v 10000 -a 0 -q --cifar10 -d 0.5 -m 16 -g '0.01;0.05;0.1;0.5'
deepstrom -e 200 -s 128 -v 10000 -a 0 -q --cifar10 -d 0.5 -m 32 -g '0.01;0.05;0.1;0.5'
deepstrom -e 200 -s 128 -v 10000 -a 0 -q --cifar10 -d 1.0 -T -m 8 -g '0.01;0.05;0.1;0.5'
deepstrom -e 200 -s 128 -v 10000 -a 0 -q --cifar10 -d 1.0 -T -m 16 -g '0.01;0.05;0.1;0.5'
deepstrom -e 200 -s 128 -v 10000 -a 0 -q --cifar10 -d 1.0 -T -m 32 -g '0.01;0.05;0.1;0.5'
deepstrom -e 200 -s 128 -v 10000 -a 0 -q --cifar10 -d 1.0 -m 8 -g '0.01;0.05;0.1;0.5'
deepstrom -e 200 -s 128 -v 10000 -a 0 -q --cifar10 -d 1.0 -m 16 -g '0.01;0.05;0.1;0.5'
deepstrom -e 200 -s 128 -v 10000 -a 0 -q --cifar10 -d 1.0 -m 32 -g '0.01;0.05;0.1;0.5'
