deepfriedconvnet -e 50 -s 128 -v 10000 -a 0 --cifar -N 1 --bad-repr 1 -g 0.000693838652375192
deepfriedconvnet -e 50 -s 128 -v 10000 -a 1 --cifar -N 1 --bad-repr 1 -g 0.000693838652375192
deepfriedconvnet -e 50 -s 128 -v 10000 -a 2 --cifar -N 1 --bad-repr 1 -g 0.000693838652375192
deepfriedconvnet -e 50 -s 128 -v 10000 -a 3 --cifar -N 1 --bad-repr 1 -g 0.000693838652375192
deepfriedconvnet -e 50 -s 128 -v 10000 -a 4 --cifar -N 1 --bad-repr 1 -g 0.000693838652375192
deepfriedconvnet -e 50 -s 128 -v 10000 -a 5 --cifar -N 1 --bad-repr 1 -g 0.000693838652375192
deepfriedconvnet -e 50 -s 128 -v 10000 -a 6 --cifar -N 1 --bad-repr 1 -g 0.000693838652375192
deepfriedconvnet -e 50 -s 128 -v 10000 -a 7 --cifar -N 1 --bad-repr 1 -g 0.000693838652375192
deepfriedconvnet -e 50 -s 128 -v 10000 -a 8 --cifar -N 1 --bad-repr 1 -g 0.000693838652375192
deepfriedconvnet -e 50 -s 128 -v 10000 -a 9 --cifar -N 1 --bad-repr 1 -g 0.000693838652375192
deepfriedconvnet -e 50 -s 128 -v 10000 -a 0 --cifar -N 1 --bad-repr 3 -g 0.00011844923642793259
deepfriedconvnet -e 50 -s 128 -v 10000 -a 1 --cifar -N 1 --bad-repr 3 -g 0.00011844923642793259
deepfriedconvnet -e 50 -s 128 -v 10000 -a 2 --cifar -N 1 --bad-repr 3 -g 0.00011844923642793259
deepfriedconvnet -e 50 -s 128 -v 10000 -a 3 --cifar -N 1 --bad-repr 3 -g 0.00011844923642793259
deepfriedconvnet -e 50 -s 128 -v 10000 -a 4 --cifar -N 1 --bad-repr 3 -g 0.00011844923642793259
deepfriedconvnet -e 50 -s 128 -v 10000 -a 5 --cifar -N 1 --bad-repr 3 -g 0.00011844923642793259
deepfriedconvnet -e 50 -s 128 -v 10000 -a 6 --cifar -N 1 --bad-repr 3 -g 0.00011844923642793259
deepfriedconvnet -e 50 -s 128 -v 10000 -a 7 --cifar -N 1 --bad-repr 3 -g 0.00011844923642793259
deepfriedconvnet -e 50 -s 128 -v 10000 -a 8 --cifar -N 1 --bad-repr 3 -g 0.00011844923642793259
deepfriedconvnet -e 50 -s 128 -v 10000 -a 9 --cifar -N 1 --bad-repr 3 -g 0.00011844923642793259
deepfriedconvnet -e 50 -s 128 -v 10000 -a 0 --cifar -N 1 --bad-repr 4 -g 2.5274795875746927e-05
deepfriedconvnet -e 50 -s 128 -v 10000 -a 1 --cifar -N 1 --bad-repr 4 -g 2.5274795875746927e-05
deepfriedconvnet -e 50 -s 128 -v 10000 -a 2 --cifar -N 1 --bad-repr 4 -g 2.5274795875746927e-05
deepfriedconvnet -e 50 -s 128 -v 10000 -a 3 --cifar -N 1 --bad-repr 4 -g 2.5274795875746927e-05
deepfriedconvnet -e 50 -s 128 -v 10000 -a 4 --cifar -N 1 --bad-repr 4 -g 2.5274795875746927e-05
deepfriedconvnet -e 50 -s 128 -v 10000 -a 5 --cifar -N 1 --bad-repr 4 -g 2.5274795875746927e-05
deepfriedconvnet -e 50 -s 128 -v 10000 -a 6 --cifar -N 1 --bad-repr 4 -g 2.5274795875746927e-05
deepfriedconvnet -e 50 -s 128 -v 10000 -a 7 --cifar -N 1 --bad-repr 4 -g 2.5274795875746927e-05
deepfriedconvnet -e 50 -s 128 -v 10000 -a 8 --cifar -N 1 --bad-repr 4 -g 2.5274795875746927e-05
deepfriedconvnet -e 50 -s 128 -v 10000 -a 9 --cifar -N 1 --bad-repr 4 -g 2.5274795875746927e-05
deepstrom -e 50 -s 128 -v 10000 -a 0 --cifar -m 2 -r -R --bad-repr 1 -g 0.000693838652375192
deepstrom -e 50 -s 128 -v 10000 -a 0 --cifar -m 4 -r -R --bad-repr 1 -g 0.000693838652375192
deepstrom -e 50 -s 128 -v 10000 -a 0 --cifar -m 8 -r -R --bad-repr 1 -g 0.000693838652375192
deepstrom -e 50 -s 128 -v 10000 -a 0 --cifar -m 16 -r -R --bad-repr 1 -g 0.000693838652375192
deepstrom -e 50 -s 128 -v 10000 -a 0 --cifar -m 32 -r -R --bad-repr 1 -g 0.000693838652375192
deepstrom -e 50 -s 128 -v 10000 -a 0 --cifar -m 64 -r -R --bad-repr 1 -g 0.000693838652375192
deepstrom -e 50 -s 128 -v 10000 -a 0 --cifar -m 128 -r -R --bad-repr 1 -g 0.000693838652375192
deepstrom -e 50 -s 128 -v 10000 -a 1 --cifar -m 2 -r -R --bad-repr 1 -g 0.000693838652375192
deepstrom -e 50 -s 128 -v 10000 -a 1 --cifar -m 4 -r -R --bad-repr 1 -g 0.000693838652375192
deepstrom -e 50 -s 128 -v 10000 -a 1 --cifar -m 8 -r -R --bad-repr 1 -g 0.000693838652375192
deepstrom -e 50 -s 128 -v 10000 -a 1 --cifar -m 16 -r -R --bad-repr 1 -g 0.000693838652375192
deepstrom -e 50 -s 128 -v 10000 -a 1 --cifar -m 32 -r -R --bad-repr 1 -g 0.000693838652375192
deepstrom -e 50 -s 128 -v 10000 -a 1 --cifar -m 64 -r -R --bad-repr 1 -g 0.000693838652375192
deepstrom -e 50 -s 128 -v 10000 -a 1 --cifar -m 128 -r -R --bad-repr 1 -g 0.000693838652375192
deepstrom -e 50 -s 128 -v 10000 -a 2 --cifar -m 2 -r -R --bad-repr 1 -g 0.000693838652375192
deepstrom -e 50 -s 128 -v 10000 -a 2 --cifar -m 4 -r -R --bad-repr 1 -g 0.000693838652375192
deepstrom -e 50 -s 128 -v 10000 -a 2 --cifar -m 8 -r -R --bad-repr 1 -g 0.000693838652375192
deepstrom -e 50 -s 128 -v 10000 -a 2 --cifar -m 16 -r -R --bad-repr 1 -g 0.000693838652375192
deepstrom -e 50 -s 128 -v 10000 -a 2 --cifar -m 32 -r -R --bad-repr 1 -g 0.000693838652375192
deepstrom -e 50 -s 128 -v 10000 -a 2 --cifar -m 64 -r -R --bad-repr 1 -g 0.000693838652375192
deepstrom -e 50 -s 128 -v 10000 -a 2 --cifar -m 128 -r -R --bad-repr 1 -g 0.000693838652375192
deepstrom -e 50 -s 128 -v 10000 -a 3 --cifar -m 2 -r -R --bad-repr 1 -g 0.000693838652375192
deepstrom -e 50 -s 128 -v 10000 -a 3 --cifar -m 4 -r -R --bad-repr 1 -g 0.000693838652375192
deepstrom -e 50 -s 128 -v 10000 -a 3 --cifar -m 8 -r -R --bad-repr 1 -g 0.000693838652375192
deepstrom -e 50 -s 128 -v 10000 -a 3 --cifar -m 16 -r -R --bad-repr 1 -g 0.000693838652375192
deepstrom -e 50 -s 128 -v 10000 -a 3 --cifar -m 32 -r -R --bad-repr 1 -g 0.000693838652375192
deepstrom -e 50 -s 128 -v 10000 -a 3 --cifar -m 64 -r -R --bad-repr 1 -g 0.000693838652375192
deepstrom -e 50 -s 128 -v 10000 -a 3 --cifar -m 128 -r -R --bad-repr 1 -g 0.000693838652375192
deepstrom -e 50 -s 128 -v 10000 -a 4 --cifar -m 2 -r -R --bad-repr 1 -g 0.000693838652375192
deepstrom -e 50 -s 128 -v 10000 -a 4 --cifar -m 4 -r -R --bad-repr 1 -g 0.000693838652375192
deepstrom -e 50 -s 128 -v 10000 -a 4 --cifar -m 8 -r -R --bad-repr 1 -g 0.000693838652375192
deepstrom -e 50 -s 128 -v 10000 -a 4 --cifar -m 16 -r -R --bad-repr 1 -g 0.000693838652375192
deepstrom -e 50 -s 128 -v 10000 -a 4 --cifar -m 32 -r -R --bad-repr 1 -g 0.000693838652375192
deepstrom -e 50 -s 128 -v 10000 -a 4 --cifar -m 64 -r -R --bad-repr 1 -g 0.000693838652375192
deepstrom -e 50 -s 128 -v 10000 -a 4 --cifar -m 128 -r -R --bad-repr 1 -g 0.000693838652375192
deepstrom -e 50 -s 128 -v 10000 -a 5 --cifar -m 2 -r -R --bad-repr 1 -g 0.000693838652375192
deepstrom -e 50 -s 128 -v 10000 -a 5 --cifar -m 4 -r -R --bad-repr 1 -g 0.000693838652375192
deepstrom -e 50 -s 128 -v 10000 -a 5 --cifar -m 8 -r -R --bad-repr 1 -g 0.000693838652375192
deepstrom -e 50 -s 128 -v 10000 -a 5 --cifar -m 16 -r -R --bad-repr 1 -g 0.000693838652375192
deepstrom -e 50 -s 128 -v 10000 -a 5 --cifar -m 32 -r -R --bad-repr 1 -g 0.000693838652375192
deepstrom -e 50 -s 128 -v 10000 -a 5 --cifar -m 64 -r -R --bad-repr 1 -g 0.000693838652375192
deepstrom -e 50 -s 128 -v 10000 -a 5 --cifar -m 128 -r -R --bad-repr 1 -g 0.000693838652375192
deepstrom -e 50 -s 128 -v 10000 -a 6 --cifar -m 2 -r -R --bad-repr 1 -g 0.000693838652375192
deepstrom -e 50 -s 128 -v 10000 -a 6 --cifar -m 4 -r -R --bad-repr 1 -g 0.000693838652375192
deepstrom -e 50 -s 128 -v 10000 -a 6 --cifar -m 8 -r -R --bad-repr 1 -g 0.000693838652375192
deepstrom -e 50 -s 128 -v 10000 -a 6 --cifar -m 16 -r -R --bad-repr 1 -g 0.000693838652375192
deepstrom -e 50 -s 128 -v 10000 -a 6 --cifar -m 32 -r -R --bad-repr 1 -g 0.000693838652375192
deepstrom -e 50 -s 128 -v 10000 -a 6 --cifar -m 64 -r -R --bad-repr 1 -g 0.000693838652375192
deepstrom -e 50 -s 128 -v 10000 -a 6 --cifar -m 128 -r -R --bad-repr 1 -g 0.000693838652375192
deepstrom -e 50 -s 128 -v 10000 -a 7 --cifar -m 2 -r -R --bad-repr 1 -g 0.000693838652375192
deepstrom -e 50 -s 128 -v 10000 -a 7 --cifar -m 4 -r -R --bad-repr 1 -g 0.000693838652375192
deepstrom -e 50 -s 128 -v 10000 -a 7 --cifar -m 8 -r -R --bad-repr 1 -g 0.000693838652375192
deepstrom -e 50 -s 128 -v 10000 -a 7 --cifar -m 16 -r -R --bad-repr 1 -g 0.000693838652375192
deepstrom -e 50 -s 128 -v 10000 -a 7 --cifar -m 32 -r -R --bad-repr 1 -g 0.000693838652375192
deepstrom -e 50 -s 128 -v 10000 -a 7 --cifar -m 64 -r -R --bad-repr 1 -g 0.000693838652375192
deepstrom -e 50 -s 128 -v 10000 -a 7 --cifar -m 128 -r -R --bad-repr 1 -g 0.000693838652375192
deepstrom -e 50 -s 128 -v 10000 -a 8 --cifar -m 2 -r -R --bad-repr 1 -g 0.000693838652375192
deepstrom -e 50 -s 128 -v 10000 -a 8 --cifar -m 4 -r -R --bad-repr 1 -g 0.000693838652375192
deepstrom -e 50 -s 128 -v 10000 -a 8 --cifar -m 8 -r -R --bad-repr 1 -g 0.000693838652375192
deepstrom -e 50 -s 128 -v 10000 -a 8 --cifar -m 16 -r -R --bad-repr 1 -g 0.000693838652375192
deepstrom -e 50 -s 128 -v 10000 -a 8 --cifar -m 32 -r -R --bad-repr 1 -g 0.000693838652375192
deepstrom -e 50 -s 128 -v 10000 -a 8 --cifar -m 64 -r -R --bad-repr 1 -g 0.000693838652375192
deepstrom -e 50 -s 128 -v 10000 -a 8 --cifar -m 128 -r -R --bad-repr 1 -g 0.000693838652375192
deepstrom -e 50 -s 128 -v 10000 -a 9 --cifar -m 2 -r -R --bad-repr 1 -g 0.000693838652375192
deepstrom -e 50 -s 128 -v 10000 -a 9 --cifar -m 4 -r -R --bad-repr 1 -g 0.000693838652375192
deepstrom -e 50 -s 128 -v 10000 -a 9 --cifar -m 8 -r -R --bad-repr 1 -g 0.000693838652375192
deepstrom -e 50 -s 128 -v 10000 -a 9 --cifar -m 16 -r -R --bad-repr 1 -g 0.000693838652375192
deepstrom -e 50 -s 128 -v 10000 -a 9 --cifar -m 32 -r -R --bad-repr 1 -g 0.000693838652375192
deepstrom -e 50 -s 128 -v 10000 -a 9 --cifar -m 64 -r -R --bad-repr 1 -g 0.000693838652375192
deepstrom -e 50 -s 128 -v 10000 -a 9 --cifar -m 128 -r -R --bad-repr 1 -g 0.000693838652375192
deepstrom -e 50 -s 128 -v 10000 -a 0 --cifar -m 2 -R --bad-repr 1 -g 0.000693838652375192
deepstrom -e 50 -s 128 -v 10000 -a 0 --cifar -m 4 -R --bad-repr 1 -g 0.000693838652375192
deepstrom -e 50 -s 128 -v 10000 -a 0 --cifar -m 8 -R --bad-repr 1 -g 0.000693838652375192
deepstrom -e 50 -s 128 -v 10000 -a 0 --cifar -m 16 -R --bad-repr 1 -g 0.000693838652375192
deepstrom -e 50 -s 128 -v 10000 -a 0 --cifar -m 32 -R --bad-repr 1 -g 0.000693838652375192
deepstrom -e 50 -s 128 -v 10000 -a 0 --cifar -m 64 -R --bad-repr 1 -g 0.000693838652375192
deepstrom -e 50 -s 128 -v 10000 -a 0 --cifar -m 128 -R --bad-repr 1 -g 0.000693838652375192
deepstrom -e 50 -s 128 -v 10000 -a 1 --cifar -m 2 -R --bad-repr 1 -g 0.000693838652375192
deepstrom -e 50 -s 128 -v 10000 -a 1 --cifar -m 4 -R --bad-repr 1 -g 0.000693838652375192
deepstrom -e 50 -s 128 -v 10000 -a 1 --cifar -m 8 -R --bad-repr 1 -g 0.000693838652375192
deepstrom -e 50 -s 128 -v 10000 -a 1 --cifar -m 16 -R --bad-repr 1 -g 0.000693838652375192
deepstrom -e 50 -s 128 -v 10000 -a 1 --cifar -m 32 -R --bad-repr 1 -g 0.000693838652375192
deepstrom -e 50 -s 128 -v 10000 -a 1 --cifar -m 64 -R --bad-repr 1 -g 0.000693838652375192
deepstrom -e 50 -s 128 -v 10000 -a 1 --cifar -m 128 -R --bad-repr 1 -g 0.000693838652375192
deepstrom -e 50 -s 128 -v 10000 -a 2 --cifar -m 2 -R --bad-repr 1 -g 0.000693838652375192
deepstrom -e 50 -s 128 -v 10000 -a 2 --cifar -m 4 -R --bad-repr 1 -g 0.000693838652375192
deepstrom -e 50 -s 128 -v 10000 -a 2 --cifar -m 8 -R --bad-repr 1 -g 0.000693838652375192
deepstrom -e 50 -s 128 -v 10000 -a 2 --cifar -m 16 -R --bad-repr 1 -g 0.000693838652375192
deepstrom -e 50 -s 128 -v 10000 -a 2 --cifar -m 32 -R --bad-repr 1 -g 0.000693838652375192
deepstrom -e 50 -s 128 -v 10000 -a 2 --cifar -m 64 -R --bad-repr 1 -g 0.000693838652375192
deepstrom -e 50 -s 128 -v 10000 -a 2 --cifar -m 128 -R --bad-repr 1 -g 0.000693838652375192
deepstrom -e 50 -s 128 -v 10000 -a 3 --cifar -m 2 -R --bad-repr 1 -g 0.000693838652375192
deepstrom -e 50 -s 128 -v 10000 -a 3 --cifar -m 4 -R --bad-repr 1 -g 0.000693838652375192
deepstrom -e 50 -s 128 -v 10000 -a 3 --cifar -m 8 -R --bad-repr 1 -g 0.000693838652375192
deepstrom -e 50 -s 128 -v 10000 -a 3 --cifar -m 16 -R --bad-repr 1 -g 0.000693838652375192
deepstrom -e 50 -s 128 -v 10000 -a 3 --cifar -m 32 -R --bad-repr 1 -g 0.000693838652375192
deepstrom -e 50 -s 128 -v 10000 -a 3 --cifar -m 64 -R --bad-repr 1 -g 0.000693838652375192
deepstrom -e 50 -s 128 -v 10000 -a 3 --cifar -m 128 -R --bad-repr 1 -g 0.000693838652375192
deepstrom -e 50 -s 128 -v 10000 -a 4 --cifar -m 2 -R --bad-repr 1 -g 0.000693838652375192
deepstrom -e 50 -s 128 -v 10000 -a 4 --cifar -m 4 -R --bad-repr 1 -g 0.000693838652375192
deepstrom -e 50 -s 128 -v 10000 -a 4 --cifar -m 8 -R --bad-repr 1 -g 0.000693838652375192
deepstrom -e 50 -s 128 -v 10000 -a 4 --cifar -m 16 -R --bad-repr 1 -g 0.000693838652375192
deepstrom -e 50 -s 128 -v 10000 -a 4 --cifar -m 32 -R --bad-repr 1 -g 0.000693838652375192
deepstrom -e 50 -s 128 -v 10000 -a 4 --cifar -m 64 -R --bad-repr 1 -g 0.000693838652375192
deepstrom -e 50 -s 128 -v 10000 -a 4 --cifar -m 128 -R --bad-repr 1 -g 0.000693838652375192
deepstrom -e 50 -s 128 -v 10000 -a 5 --cifar -m 2 -R --bad-repr 1 -g 0.000693838652375192
deepstrom -e 50 -s 128 -v 10000 -a 5 --cifar -m 4 -R --bad-repr 1 -g 0.000693838652375192
deepstrom -e 50 -s 128 -v 10000 -a 5 --cifar -m 8 -R --bad-repr 1 -g 0.000693838652375192
deepstrom -e 50 -s 128 -v 10000 -a 5 --cifar -m 16 -R --bad-repr 1 -g 0.000693838652375192
deepstrom -e 50 -s 128 -v 10000 -a 5 --cifar -m 32 -R --bad-repr 1 -g 0.000693838652375192
deepstrom -e 50 -s 128 -v 10000 -a 5 --cifar -m 64 -R --bad-repr 1 -g 0.000693838652375192
deepstrom -e 50 -s 128 -v 10000 -a 5 --cifar -m 128 -R --bad-repr 1 -g 0.000693838652375192
deepstrom -e 50 -s 128 -v 10000 -a 6 --cifar -m 2 -R --bad-repr 1 -g 0.000693838652375192
deepstrom -e 50 -s 128 -v 10000 -a 6 --cifar -m 4 -R --bad-repr 1 -g 0.000693838652375192
deepstrom -e 50 -s 128 -v 10000 -a 6 --cifar -m 8 -R --bad-repr 1 -g 0.000693838652375192
deepstrom -e 50 -s 128 -v 10000 -a 6 --cifar -m 16 -R --bad-repr 1 -g 0.000693838652375192
deepstrom -e 50 -s 128 -v 10000 -a 6 --cifar -m 32 -R --bad-repr 1 -g 0.000693838652375192
deepstrom -e 50 -s 128 -v 10000 -a 6 --cifar -m 64 -R --bad-repr 1 -g 0.000693838652375192
deepstrom -e 50 -s 128 -v 10000 -a 6 --cifar -m 128 -R --bad-repr 1 -g 0.000693838652375192
deepstrom -e 50 -s 128 -v 10000 -a 7 --cifar -m 2 -R --bad-repr 1 -g 0.000693838652375192
deepstrom -e 50 -s 128 -v 10000 -a 7 --cifar -m 4 -R --bad-repr 1 -g 0.000693838652375192
deepstrom -e 50 -s 128 -v 10000 -a 7 --cifar -m 8 -R --bad-repr 1 -g 0.000693838652375192
deepstrom -e 50 -s 128 -v 10000 -a 7 --cifar -m 16 -R --bad-repr 1 -g 0.000693838652375192
deepstrom -e 50 -s 128 -v 10000 -a 7 --cifar -m 32 -R --bad-repr 1 -g 0.000693838652375192
deepstrom -e 50 -s 128 -v 10000 -a 7 --cifar -m 64 -R --bad-repr 1 -g 0.000693838652375192
deepstrom -e 50 -s 128 -v 10000 -a 7 --cifar -m 128 -R --bad-repr 1 -g 0.000693838652375192
deepstrom -e 50 -s 128 -v 10000 -a 8 --cifar -m 2 -R --bad-repr 1 -g 0.000693838652375192
deepstrom -e 50 -s 128 -v 10000 -a 8 --cifar -m 4 -R --bad-repr 1 -g 0.000693838652375192
deepstrom -e 50 -s 128 -v 10000 -a 8 --cifar -m 8 -R --bad-repr 1 -g 0.000693838652375192
deepstrom -e 50 -s 128 -v 10000 -a 8 --cifar -m 16 -R --bad-repr 1 -g 0.000693838652375192
deepstrom -e 50 -s 128 -v 10000 -a 8 --cifar -m 32 -R --bad-repr 1 -g 0.000693838652375192
deepstrom -e 50 -s 128 -v 10000 -a 8 --cifar -m 64 -R --bad-repr 1 -g 0.000693838652375192
deepstrom -e 50 -s 128 -v 10000 -a 8 --cifar -m 128 -R --bad-repr 1 -g 0.000693838652375192
deepstrom -e 50 -s 128 -v 10000 -a 9 --cifar -m 2 -R --bad-repr 1 -g 0.000693838652375192
deepstrom -e 50 -s 128 -v 10000 -a 9 --cifar -m 4 -R --bad-repr 1 -g 0.000693838652375192
deepstrom -e 50 -s 128 -v 10000 -a 9 --cifar -m 8 -R --bad-repr 1 -g 0.000693838652375192
deepstrom -e 50 -s 128 -v 10000 -a 9 --cifar -m 16 -R --bad-repr 1 -g 0.000693838652375192
deepstrom -e 50 -s 128 -v 10000 -a 9 --cifar -m 32 -R --bad-repr 1 -g 0.000693838652375192
deepstrom -e 50 -s 128 -v 10000 -a 9 --cifar -m 64 -R --bad-repr 1 -g 0.000693838652375192
deepstrom -e 50 -s 128 -v 10000 -a 9 --cifar -m 128 -R --bad-repr 1 -g 0.000693838652375192
deepstrom -e 50 -s 128 -v 10000 -a 0 --cifar -m 2 -r -R --bad-repr 3 -g 0.00011844923642793259
deepstrom -e 50 -s 128 -v 10000 -a 0 --cifar -m 4 -r -R --bad-repr 3 -g 0.00011844923642793259
deepstrom -e 50 -s 128 -v 10000 -a 0 --cifar -m 8 -r -R --bad-repr 3 -g 0.00011844923642793259
deepstrom -e 50 -s 128 -v 10000 -a 0 --cifar -m 16 -r -R --bad-repr 3 -g 0.00011844923642793259
deepstrom -e 50 -s 128 -v 10000 -a 0 --cifar -m 32 -r -R --bad-repr 3 -g 0.00011844923642793259
deepstrom -e 50 -s 128 -v 10000 -a 0 --cifar -m 64 -r -R --bad-repr 3 -g 0.00011844923642793259
deepstrom -e 50 -s 128 -v 10000 -a 0 --cifar -m 128 -r -R --bad-repr 3 -g 0.00011844923642793259
deepstrom -e 50 -s 128 -v 10000 -a 1 --cifar -m 2 -r -R --bad-repr 3 -g 0.00011844923642793259
deepstrom -e 50 -s 128 -v 10000 -a 1 --cifar -m 4 -r -R --bad-repr 3 -g 0.00011844923642793259
deepstrom -e 50 -s 128 -v 10000 -a 1 --cifar -m 8 -r -R --bad-repr 3 -g 0.00011844923642793259
deepstrom -e 50 -s 128 -v 10000 -a 1 --cifar -m 16 -r -R --bad-repr 3 -g 0.00011844923642793259
deepstrom -e 50 -s 128 -v 10000 -a 1 --cifar -m 32 -r -R --bad-repr 3 -g 0.00011844923642793259
deepstrom -e 50 -s 128 -v 10000 -a 1 --cifar -m 64 -r -R --bad-repr 3 -g 0.00011844923642793259
deepstrom -e 50 -s 128 -v 10000 -a 1 --cifar -m 128 -r -R --bad-repr 3 -g 0.00011844923642793259
deepstrom -e 50 -s 128 -v 10000 -a 2 --cifar -m 2 -r -R --bad-repr 3 -g 0.00011844923642793259
deepstrom -e 50 -s 128 -v 10000 -a 2 --cifar -m 4 -r -R --bad-repr 3 -g 0.00011844923642793259
deepstrom -e 50 -s 128 -v 10000 -a 2 --cifar -m 8 -r -R --bad-repr 3 -g 0.00011844923642793259
deepstrom -e 50 -s 128 -v 10000 -a 2 --cifar -m 16 -r -R --bad-repr 3 -g 0.00011844923642793259
deepstrom -e 50 -s 128 -v 10000 -a 2 --cifar -m 32 -r -R --bad-repr 3 -g 0.00011844923642793259
deepstrom -e 50 -s 128 -v 10000 -a 2 --cifar -m 64 -r -R --bad-repr 3 -g 0.00011844923642793259
deepstrom -e 50 -s 128 -v 10000 -a 2 --cifar -m 128 -r -R --bad-repr 3 -g 0.00011844923642793259
deepstrom -e 50 -s 128 -v 10000 -a 3 --cifar -m 2 -r -R --bad-repr 3 -g 0.00011844923642793259
deepstrom -e 50 -s 128 -v 10000 -a 3 --cifar -m 4 -r -R --bad-repr 3 -g 0.00011844923642793259
deepstrom -e 50 -s 128 -v 10000 -a 3 --cifar -m 8 -r -R --bad-repr 3 -g 0.00011844923642793259
deepstrom -e 50 -s 128 -v 10000 -a 3 --cifar -m 16 -r -R --bad-repr 3 -g 0.00011844923642793259
deepstrom -e 50 -s 128 -v 10000 -a 3 --cifar -m 32 -r -R --bad-repr 3 -g 0.00011844923642793259
deepstrom -e 50 -s 128 -v 10000 -a 3 --cifar -m 64 -r -R --bad-repr 3 -g 0.00011844923642793259
deepstrom -e 50 -s 128 -v 10000 -a 3 --cifar -m 128 -r -R --bad-repr 3 -g 0.00011844923642793259
deepstrom -e 50 -s 128 -v 10000 -a 4 --cifar -m 2 -r -R --bad-repr 3 -g 0.00011844923642793259
deepstrom -e 50 -s 128 -v 10000 -a 4 --cifar -m 4 -r -R --bad-repr 3 -g 0.00011844923642793259
deepstrom -e 50 -s 128 -v 10000 -a 4 --cifar -m 8 -r -R --bad-repr 3 -g 0.00011844923642793259
deepstrom -e 50 -s 128 -v 10000 -a 4 --cifar -m 16 -r -R --bad-repr 3 -g 0.00011844923642793259
deepstrom -e 50 -s 128 -v 10000 -a 4 --cifar -m 32 -r -R --bad-repr 3 -g 0.00011844923642793259
deepstrom -e 50 -s 128 -v 10000 -a 4 --cifar -m 64 -r -R --bad-repr 3 -g 0.00011844923642793259
deepstrom -e 50 -s 128 -v 10000 -a 4 --cifar -m 128 -r -R --bad-repr 3 -g 0.00011844923642793259
deepstrom -e 50 -s 128 -v 10000 -a 5 --cifar -m 2 -r -R --bad-repr 3 -g 0.00011844923642793259
deepstrom -e 50 -s 128 -v 10000 -a 5 --cifar -m 4 -r -R --bad-repr 3 -g 0.00011844923642793259
deepstrom -e 50 -s 128 -v 10000 -a 5 --cifar -m 8 -r -R --bad-repr 3 -g 0.00011844923642793259
deepstrom -e 50 -s 128 -v 10000 -a 5 --cifar -m 16 -r -R --bad-repr 3 -g 0.00011844923642793259
deepstrom -e 50 -s 128 -v 10000 -a 5 --cifar -m 32 -r -R --bad-repr 3 -g 0.00011844923642793259
deepstrom -e 50 -s 128 -v 10000 -a 5 --cifar -m 64 -r -R --bad-repr 3 -g 0.00011844923642793259
deepstrom -e 50 -s 128 -v 10000 -a 5 --cifar -m 128 -r -R --bad-repr 3 -g 0.00011844923642793259
deepstrom -e 50 -s 128 -v 10000 -a 6 --cifar -m 2 -r -R --bad-repr 3 -g 0.00011844923642793259
deepstrom -e 50 -s 128 -v 10000 -a 6 --cifar -m 4 -r -R --bad-repr 3 -g 0.00011844923642793259
deepstrom -e 50 -s 128 -v 10000 -a 6 --cifar -m 8 -r -R --bad-repr 3 -g 0.00011844923642793259
deepstrom -e 50 -s 128 -v 10000 -a 6 --cifar -m 16 -r -R --bad-repr 3 -g 0.00011844923642793259
deepstrom -e 50 -s 128 -v 10000 -a 6 --cifar -m 32 -r -R --bad-repr 3 -g 0.00011844923642793259
deepstrom -e 50 -s 128 -v 10000 -a 6 --cifar -m 64 -r -R --bad-repr 3 -g 0.00011844923642793259
deepstrom -e 50 -s 128 -v 10000 -a 6 --cifar -m 128 -r -R --bad-repr 3 -g 0.00011844923642793259
deepstrom -e 50 -s 128 -v 10000 -a 7 --cifar -m 2 -r -R --bad-repr 3 -g 0.00011844923642793259
deepstrom -e 50 -s 128 -v 10000 -a 7 --cifar -m 4 -r -R --bad-repr 3 -g 0.00011844923642793259
deepstrom -e 50 -s 128 -v 10000 -a 7 --cifar -m 8 -r -R --bad-repr 3 -g 0.00011844923642793259
deepstrom -e 50 -s 128 -v 10000 -a 7 --cifar -m 16 -r -R --bad-repr 3 -g 0.00011844923642793259
deepstrom -e 50 -s 128 -v 10000 -a 7 --cifar -m 32 -r -R --bad-repr 3 -g 0.00011844923642793259
deepstrom -e 50 -s 128 -v 10000 -a 7 --cifar -m 64 -r -R --bad-repr 3 -g 0.00011844923642793259
deepstrom -e 50 -s 128 -v 10000 -a 7 --cifar -m 128 -r -R --bad-repr 3 -g 0.00011844923642793259
deepstrom -e 50 -s 128 -v 10000 -a 8 --cifar -m 2 -r -R --bad-repr 3 -g 0.00011844923642793259
deepstrom -e 50 -s 128 -v 10000 -a 8 --cifar -m 4 -r -R --bad-repr 3 -g 0.00011844923642793259
deepstrom -e 50 -s 128 -v 10000 -a 8 --cifar -m 8 -r -R --bad-repr 3 -g 0.00011844923642793259
deepstrom -e 50 -s 128 -v 10000 -a 8 --cifar -m 16 -r -R --bad-repr 3 -g 0.00011844923642793259
deepstrom -e 50 -s 128 -v 10000 -a 8 --cifar -m 32 -r -R --bad-repr 3 -g 0.00011844923642793259
deepstrom -e 50 -s 128 -v 10000 -a 8 --cifar -m 64 -r -R --bad-repr 3 -g 0.00011844923642793259
deepstrom -e 50 -s 128 -v 10000 -a 8 --cifar -m 128 -r -R --bad-repr 3 -g 0.00011844923642793259
deepstrom -e 50 -s 128 -v 10000 -a 9 --cifar -m 2 -r -R --bad-repr 3 -g 0.00011844923642793259
deepstrom -e 50 -s 128 -v 10000 -a 9 --cifar -m 4 -r -R --bad-repr 3 -g 0.00011844923642793259
deepstrom -e 50 -s 128 -v 10000 -a 9 --cifar -m 8 -r -R --bad-repr 3 -g 0.00011844923642793259
deepstrom -e 50 -s 128 -v 10000 -a 9 --cifar -m 16 -r -R --bad-repr 3 -g 0.00011844923642793259
deepstrom -e 50 -s 128 -v 10000 -a 9 --cifar -m 32 -r -R --bad-repr 3 -g 0.00011844923642793259
deepstrom -e 50 -s 128 -v 10000 -a 9 --cifar -m 64 -r -R --bad-repr 3 -g 0.00011844923642793259
deepstrom -e 50 -s 128 -v 10000 -a 9 --cifar -m 128 -r -R --bad-repr 3 -g 0.00011844923642793259
deepstrom -e 50 -s 128 -v 10000 -a 0 --cifar -m 2 -R --bad-repr 3 -g 0.00011844923642793259
deepstrom -e 50 -s 128 -v 10000 -a 0 --cifar -m 4 -R --bad-repr 3 -g 0.00011844923642793259
deepstrom -e 50 -s 128 -v 10000 -a 0 --cifar -m 8 -R --bad-repr 3 -g 0.00011844923642793259
deepstrom -e 50 -s 128 -v 10000 -a 0 --cifar -m 16 -R --bad-repr 3 -g 0.00011844923642793259
deepstrom -e 50 -s 128 -v 10000 -a 0 --cifar -m 32 -R --bad-repr 3 -g 0.00011844923642793259
deepstrom -e 50 -s 128 -v 10000 -a 0 --cifar -m 64 -R --bad-repr 3 -g 0.00011844923642793259
deepstrom -e 50 -s 128 -v 10000 -a 0 --cifar -m 128 -R --bad-repr 3 -g 0.00011844923642793259
deepstrom -e 50 -s 128 -v 10000 -a 1 --cifar -m 2 -R --bad-repr 3 -g 0.00011844923642793259
deepstrom -e 50 -s 128 -v 10000 -a 1 --cifar -m 4 -R --bad-repr 3 -g 0.00011844923642793259
deepstrom -e 50 -s 128 -v 10000 -a 1 --cifar -m 8 -R --bad-repr 3 -g 0.00011844923642793259
deepstrom -e 50 -s 128 -v 10000 -a 1 --cifar -m 16 -R --bad-repr 3 -g 0.00011844923642793259
deepstrom -e 50 -s 128 -v 10000 -a 1 --cifar -m 32 -R --bad-repr 3 -g 0.00011844923642793259
deepstrom -e 50 -s 128 -v 10000 -a 1 --cifar -m 64 -R --bad-repr 3 -g 0.00011844923642793259
deepstrom -e 50 -s 128 -v 10000 -a 1 --cifar -m 128 -R --bad-repr 3 -g 0.00011844923642793259
deepstrom -e 50 -s 128 -v 10000 -a 2 --cifar -m 2 -R --bad-repr 3 -g 0.00011844923642793259
deepstrom -e 50 -s 128 -v 10000 -a 2 --cifar -m 4 -R --bad-repr 3 -g 0.00011844923642793259
deepstrom -e 50 -s 128 -v 10000 -a 2 --cifar -m 8 -R --bad-repr 3 -g 0.00011844923642793259
deepstrom -e 50 -s 128 -v 10000 -a 2 --cifar -m 16 -R --bad-repr 3 -g 0.00011844923642793259
deepstrom -e 50 -s 128 -v 10000 -a 2 --cifar -m 32 -R --bad-repr 3 -g 0.00011844923642793259
deepstrom -e 50 -s 128 -v 10000 -a 2 --cifar -m 64 -R --bad-repr 3 -g 0.00011844923642793259
deepstrom -e 50 -s 128 -v 10000 -a 2 --cifar -m 128 -R --bad-repr 3 -g 0.00011844923642793259
deepstrom -e 50 -s 128 -v 10000 -a 3 --cifar -m 2 -R --bad-repr 3 -g 0.00011844923642793259
deepstrom -e 50 -s 128 -v 10000 -a 3 --cifar -m 4 -R --bad-repr 3 -g 0.00011844923642793259
deepstrom -e 50 -s 128 -v 10000 -a 3 --cifar -m 8 -R --bad-repr 3 -g 0.00011844923642793259
deepstrom -e 50 -s 128 -v 10000 -a 3 --cifar -m 16 -R --bad-repr 3 -g 0.00011844923642793259
deepstrom -e 50 -s 128 -v 10000 -a 3 --cifar -m 32 -R --bad-repr 3 -g 0.00011844923642793259
deepstrom -e 50 -s 128 -v 10000 -a 3 --cifar -m 64 -R --bad-repr 3 -g 0.00011844923642793259
deepstrom -e 50 -s 128 -v 10000 -a 3 --cifar -m 128 -R --bad-repr 3 -g 0.00011844923642793259
deepstrom -e 50 -s 128 -v 10000 -a 4 --cifar -m 2 -R --bad-repr 3 -g 0.00011844923642793259
deepstrom -e 50 -s 128 -v 10000 -a 4 --cifar -m 4 -R --bad-repr 3 -g 0.00011844923642793259
deepstrom -e 50 -s 128 -v 10000 -a 4 --cifar -m 8 -R --bad-repr 3 -g 0.00011844923642793259
deepstrom -e 50 -s 128 -v 10000 -a 4 --cifar -m 16 -R --bad-repr 3 -g 0.00011844923642793259
deepstrom -e 50 -s 128 -v 10000 -a 4 --cifar -m 32 -R --bad-repr 3 -g 0.00011844923642793259
deepstrom -e 50 -s 128 -v 10000 -a 4 --cifar -m 64 -R --bad-repr 3 -g 0.00011844923642793259
deepstrom -e 50 -s 128 -v 10000 -a 4 --cifar -m 128 -R --bad-repr 3 -g 0.00011844923642793259
deepstrom -e 50 -s 128 -v 10000 -a 5 --cifar -m 2 -R --bad-repr 3 -g 0.00011844923642793259
deepstrom -e 50 -s 128 -v 10000 -a 5 --cifar -m 4 -R --bad-repr 3 -g 0.00011844923642793259
deepstrom -e 50 -s 128 -v 10000 -a 5 --cifar -m 8 -R --bad-repr 3 -g 0.00011844923642793259
deepstrom -e 50 -s 128 -v 10000 -a 5 --cifar -m 16 -R --bad-repr 3 -g 0.00011844923642793259
deepstrom -e 50 -s 128 -v 10000 -a 5 --cifar -m 32 -R --bad-repr 3 -g 0.00011844923642793259
deepstrom -e 50 -s 128 -v 10000 -a 5 --cifar -m 64 -R --bad-repr 3 -g 0.00011844923642793259
deepstrom -e 50 -s 128 -v 10000 -a 5 --cifar -m 128 -R --bad-repr 3 -g 0.00011844923642793259
deepstrom -e 50 -s 128 -v 10000 -a 6 --cifar -m 2 -R --bad-repr 3 -g 0.00011844923642793259
deepstrom -e 50 -s 128 -v 10000 -a 6 --cifar -m 4 -R --bad-repr 3 -g 0.00011844923642793259
deepstrom -e 50 -s 128 -v 10000 -a 6 --cifar -m 8 -R --bad-repr 3 -g 0.00011844923642793259
deepstrom -e 50 -s 128 -v 10000 -a 6 --cifar -m 16 -R --bad-repr 3 -g 0.00011844923642793259
deepstrom -e 50 -s 128 -v 10000 -a 6 --cifar -m 32 -R --bad-repr 3 -g 0.00011844923642793259
deepstrom -e 50 -s 128 -v 10000 -a 6 --cifar -m 64 -R --bad-repr 3 -g 0.00011844923642793259
deepstrom -e 50 -s 128 -v 10000 -a 6 --cifar -m 128 -R --bad-repr 3 -g 0.00011844923642793259
deepstrom -e 50 -s 128 -v 10000 -a 7 --cifar -m 2 -R --bad-repr 3 -g 0.00011844923642793259
deepstrom -e 50 -s 128 -v 10000 -a 7 --cifar -m 4 -R --bad-repr 3 -g 0.00011844923642793259
deepstrom -e 50 -s 128 -v 10000 -a 7 --cifar -m 8 -R --bad-repr 3 -g 0.00011844923642793259
deepstrom -e 50 -s 128 -v 10000 -a 7 --cifar -m 16 -R --bad-repr 3 -g 0.00011844923642793259
deepstrom -e 50 -s 128 -v 10000 -a 7 --cifar -m 32 -R --bad-repr 3 -g 0.00011844923642793259
deepstrom -e 50 -s 128 -v 10000 -a 7 --cifar -m 64 -R --bad-repr 3 -g 0.00011844923642793259
deepstrom -e 50 -s 128 -v 10000 -a 7 --cifar -m 128 -R --bad-repr 3 -g 0.00011844923642793259
deepstrom -e 50 -s 128 -v 10000 -a 8 --cifar -m 2 -R --bad-repr 3 -g 0.00011844923642793259
deepstrom -e 50 -s 128 -v 10000 -a 8 --cifar -m 4 -R --bad-repr 3 -g 0.00011844923642793259
deepstrom -e 50 -s 128 -v 10000 -a 8 --cifar -m 8 -R --bad-repr 3 -g 0.00011844923642793259
deepstrom -e 50 -s 128 -v 10000 -a 8 --cifar -m 16 -R --bad-repr 3 -g 0.00011844923642793259
deepstrom -e 50 -s 128 -v 10000 -a 8 --cifar -m 32 -R --bad-repr 3 -g 0.00011844923642793259
deepstrom -e 50 -s 128 -v 10000 -a 8 --cifar -m 64 -R --bad-repr 3 -g 0.00011844923642793259
deepstrom -e 50 -s 128 -v 10000 -a 8 --cifar -m 128 -R --bad-repr 3 -g 0.00011844923642793259
deepstrom -e 50 -s 128 -v 10000 -a 9 --cifar -m 2 -R --bad-repr 3 -g 0.00011844923642793259
deepstrom -e 50 -s 128 -v 10000 -a 9 --cifar -m 4 -R --bad-repr 3 -g 0.00011844923642793259
deepstrom -e 50 -s 128 -v 10000 -a 9 --cifar -m 8 -R --bad-repr 3 -g 0.00011844923642793259
deepstrom -e 50 -s 128 -v 10000 -a 9 --cifar -m 16 -R --bad-repr 3 -g 0.00011844923642793259
deepstrom -e 50 -s 128 -v 10000 -a 9 --cifar -m 32 -R --bad-repr 3 -g 0.00011844923642793259
deepstrom -e 50 -s 128 -v 10000 -a 9 --cifar -m 64 -R --bad-repr 3 -g 0.00011844923642793259
deepstrom -e 50 -s 128 -v 10000 -a 9 --cifar -m 128 -R --bad-repr 3 -g 0.00011844923642793259
deepstrom -e 50 -s 128 -v 10000 -a 0 --cifar -m 2 -r -R --bad-repr 4 -g 2.5274795875746927e-05
deepstrom -e 50 -s 128 -v 10000 -a 0 --cifar -m 4 -r -R --bad-repr 4 -g 2.5274795875746927e-05
deepstrom -e 50 -s 128 -v 10000 -a 0 --cifar -m 8 -r -R --bad-repr 4 -g 2.5274795875746927e-05
deepstrom -e 50 -s 128 -v 10000 -a 0 --cifar -m 16 -r -R --bad-repr 4 -g 2.5274795875746927e-05
deepstrom -e 50 -s 128 -v 10000 -a 0 --cifar -m 32 -r -R --bad-repr 4 -g 2.5274795875746927e-05
deepstrom -e 50 -s 128 -v 10000 -a 0 --cifar -m 64 -r -R --bad-repr 4 -g 2.5274795875746927e-05
deepstrom -e 50 -s 128 -v 10000 -a 0 --cifar -m 128 -r -R --bad-repr 4 -g 2.5274795875746927e-05
deepstrom -e 50 -s 128 -v 10000 -a 1 --cifar -m 2 -r -R --bad-repr 4 -g 2.5274795875746927e-05
deepstrom -e 50 -s 128 -v 10000 -a 1 --cifar -m 4 -r -R --bad-repr 4 -g 2.5274795875746927e-05
deepstrom -e 50 -s 128 -v 10000 -a 1 --cifar -m 8 -r -R --bad-repr 4 -g 2.5274795875746927e-05
deepstrom -e 50 -s 128 -v 10000 -a 1 --cifar -m 16 -r -R --bad-repr 4 -g 2.5274795875746927e-05
deepstrom -e 50 -s 128 -v 10000 -a 1 --cifar -m 32 -r -R --bad-repr 4 -g 2.5274795875746927e-05
deepstrom -e 50 -s 128 -v 10000 -a 1 --cifar -m 64 -r -R --bad-repr 4 -g 2.5274795875746927e-05
deepstrom -e 50 -s 128 -v 10000 -a 1 --cifar -m 128 -r -R --bad-repr 4 -g 2.5274795875746927e-05
deepstrom -e 50 -s 128 -v 10000 -a 2 --cifar -m 2 -r -R --bad-repr 4 -g 2.5274795875746927e-05
deepstrom -e 50 -s 128 -v 10000 -a 2 --cifar -m 4 -r -R --bad-repr 4 -g 2.5274795875746927e-05
deepstrom -e 50 -s 128 -v 10000 -a 2 --cifar -m 8 -r -R --bad-repr 4 -g 2.5274795875746927e-05
deepstrom -e 50 -s 128 -v 10000 -a 2 --cifar -m 16 -r -R --bad-repr 4 -g 2.5274795875746927e-05
deepstrom -e 50 -s 128 -v 10000 -a 2 --cifar -m 32 -r -R --bad-repr 4 -g 2.5274795875746927e-05
deepstrom -e 50 -s 128 -v 10000 -a 2 --cifar -m 64 -r -R --bad-repr 4 -g 2.5274795875746927e-05
deepstrom -e 50 -s 128 -v 10000 -a 2 --cifar -m 128 -r -R --bad-repr 4 -g 2.5274795875746927e-05
deepstrom -e 50 -s 128 -v 10000 -a 3 --cifar -m 2 -r -R --bad-repr 4 -g 2.5274795875746927e-05
deepstrom -e 50 -s 128 -v 10000 -a 3 --cifar -m 4 -r -R --bad-repr 4 -g 2.5274795875746927e-05
deepstrom -e 50 -s 128 -v 10000 -a 3 --cifar -m 8 -r -R --bad-repr 4 -g 2.5274795875746927e-05
deepstrom -e 50 -s 128 -v 10000 -a 3 --cifar -m 16 -r -R --bad-repr 4 -g 2.5274795875746927e-05
deepstrom -e 50 -s 128 -v 10000 -a 3 --cifar -m 32 -r -R --bad-repr 4 -g 2.5274795875746927e-05
deepstrom -e 50 -s 128 -v 10000 -a 3 --cifar -m 64 -r -R --bad-repr 4 -g 2.5274795875746927e-05
deepstrom -e 50 -s 128 -v 10000 -a 3 --cifar -m 128 -r -R --bad-repr 4 -g 2.5274795875746927e-05
deepstrom -e 50 -s 128 -v 10000 -a 4 --cifar -m 2 -r -R --bad-repr 4 -g 2.5274795875746927e-05
deepstrom -e 50 -s 128 -v 10000 -a 4 --cifar -m 4 -r -R --bad-repr 4 -g 2.5274795875746927e-05
deepstrom -e 50 -s 128 -v 10000 -a 4 --cifar -m 8 -r -R --bad-repr 4 -g 2.5274795875746927e-05
deepstrom -e 50 -s 128 -v 10000 -a 4 --cifar -m 16 -r -R --bad-repr 4 -g 2.5274795875746927e-05
deepstrom -e 50 -s 128 -v 10000 -a 4 --cifar -m 32 -r -R --bad-repr 4 -g 2.5274795875746927e-05
deepstrom -e 50 -s 128 -v 10000 -a 4 --cifar -m 64 -r -R --bad-repr 4 -g 2.5274795875746927e-05
deepstrom -e 50 -s 128 -v 10000 -a 4 --cifar -m 128 -r -R --bad-repr 4 -g 2.5274795875746927e-05
deepstrom -e 50 -s 128 -v 10000 -a 5 --cifar -m 2 -r -R --bad-repr 4 -g 2.5274795875746927e-05
deepstrom -e 50 -s 128 -v 10000 -a 5 --cifar -m 4 -r -R --bad-repr 4 -g 2.5274795875746927e-05
deepstrom -e 50 -s 128 -v 10000 -a 5 --cifar -m 8 -r -R --bad-repr 4 -g 2.5274795875746927e-05
deepstrom -e 50 -s 128 -v 10000 -a 5 --cifar -m 16 -r -R --bad-repr 4 -g 2.5274795875746927e-05
deepstrom -e 50 -s 128 -v 10000 -a 5 --cifar -m 32 -r -R --bad-repr 4 -g 2.5274795875746927e-05
deepstrom -e 50 -s 128 -v 10000 -a 5 --cifar -m 64 -r -R --bad-repr 4 -g 2.5274795875746927e-05
deepstrom -e 50 -s 128 -v 10000 -a 5 --cifar -m 128 -r -R --bad-repr 4 -g 2.5274795875746927e-05
deepstrom -e 50 -s 128 -v 10000 -a 6 --cifar -m 2 -r -R --bad-repr 4 -g 2.5274795875746927e-05
deepstrom -e 50 -s 128 -v 10000 -a 6 --cifar -m 4 -r -R --bad-repr 4 -g 2.5274795875746927e-05
deepstrom -e 50 -s 128 -v 10000 -a 6 --cifar -m 8 -r -R --bad-repr 4 -g 2.5274795875746927e-05
deepstrom -e 50 -s 128 -v 10000 -a 6 --cifar -m 16 -r -R --bad-repr 4 -g 2.5274795875746927e-05
deepstrom -e 50 -s 128 -v 10000 -a 6 --cifar -m 32 -r -R --bad-repr 4 -g 2.5274795875746927e-05
deepstrom -e 50 -s 128 -v 10000 -a 6 --cifar -m 64 -r -R --bad-repr 4 -g 2.5274795875746927e-05
deepstrom -e 50 -s 128 -v 10000 -a 6 --cifar -m 128 -r -R --bad-repr 4 -g 2.5274795875746927e-05
deepstrom -e 50 -s 128 -v 10000 -a 7 --cifar -m 2 -r -R --bad-repr 4 -g 2.5274795875746927e-05
deepstrom -e 50 -s 128 -v 10000 -a 7 --cifar -m 4 -r -R --bad-repr 4 -g 2.5274795875746927e-05
deepstrom -e 50 -s 128 -v 10000 -a 7 --cifar -m 8 -r -R --bad-repr 4 -g 2.5274795875746927e-05
deepstrom -e 50 -s 128 -v 10000 -a 7 --cifar -m 16 -r -R --bad-repr 4 -g 2.5274795875746927e-05
deepstrom -e 50 -s 128 -v 10000 -a 7 --cifar -m 32 -r -R --bad-repr 4 -g 2.5274795875746927e-05
deepstrom -e 50 -s 128 -v 10000 -a 7 --cifar -m 64 -r -R --bad-repr 4 -g 2.5274795875746927e-05
deepstrom -e 50 -s 128 -v 10000 -a 7 --cifar -m 128 -r -R --bad-repr 4 -g 2.5274795875746927e-05
deepstrom -e 50 -s 128 -v 10000 -a 8 --cifar -m 2 -r -R --bad-repr 4 -g 2.5274795875746927e-05
deepstrom -e 50 -s 128 -v 10000 -a 8 --cifar -m 4 -r -R --bad-repr 4 -g 2.5274795875746927e-05
deepstrom -e 50 -s 128 -v 10000 -a 8 --cifar -m 8 -r -R --bad-repr 4 -g 2.5274795875746927e-05
deepstrom -e 50 -s 128 -v 10000 -a 8 --cifar -m 16 -r -R --bad-repr 4 -g 2.5274795875746927e-05
deepstrom -e 50 -s 128 -v 10000 -a 8 --cifar -m 32 -r -R --bad-repr 4 -g 2.5274795875746927e-05
deepstrom -e 50 -s 128 -v 10000 -a 8 --cifar -m 64 -r -R --bad-repr 4 -g 2.5274795875746927e-05
deepstrom -e 50 -s 128 -v 10000 -a 8 --cifar -m 128 -r -R --bad-repr 4 -g 2.5274795875746927e-05
deepstrom -e 50 -s 128 -v 10000 -a 9 --cifar -m 2 -r -R --bad-repr 4 -g 2.5274795875746927e-05
deepstrom -e 50 -s 128 -v 10000 -a 9 --cifar -m 4 -r -R --bad-repr 4 -g 2.5274795875746927e-05
deepstrom -e 50 -s 128 -v 10000 -a 9 --cifar -m 8 -r -R --bad-repr 4 -g 2.5274795875746927e-05
deepstrom -e 50 -s 128 -v 10000 -a 9 --cifar -m 16 -r -R --bad-repr 4 -g 2.5274795875746927e-05
deepstrom -e 50 -s 128 -v 10000 -a 9 --cifar -m 32 -r -R --bad-repr 4 -g 2.5274795875746927e-05
deepstrom -e 50 -s 128 -v 10000 -a 9 --cifar -m 64 -r -R --bad-repr 4 -g 2.5274795875746927e-05
deepstrom -e 50 -s 128 -v 10000 -a 9 --cifar -m 128 -r -R --bad-repr 4 -g 2.5274795875746927e-05
deepstrom -e 50 -s 128 -v 10000 -a 0 --cifar -m 2 -R --bad-repr 4 -g 2.5274795875746927e-05
deepstrom -e 50 -s 128 -v 10000 -a 0 --cifar -m 4 -R --bad-repr 4 -g 2.5274795875746927e-05
deepstrom -e 50 -s 128 -v 10000 -a 0 --cifar -m 8 -R --bad-repr 4 -g 2.5274795875746927e-05
deepstrom -e 50 -s 128 -v 10000 -a 0 --cifar -m 16 -R --bad-repr 4 -g 2.5274795875746927e-05
deepstrom -e 50 -s 128 -v 10000 -a 0 --cifar -m 32 -R --bad-repr 4 -g 2.5274795875746927e-05
deepstrom -e 50 -s 128 -v 10000 -a 0 --cifar -m 64 -R --bad-repr 4 -g 2.5274795875746927e-05
deepstrom -e 50 -s 128 -v 10000 -a 0 --cifar -m 128 -R --bad-repr 4 -g 2.5274795875746927e-05
deepstrom -e 50 -s 128 -v 10000 -a 1 --cifar -m 2 -R --bad-repr 4 -g 2.5274795875746927e-05
deepstrom -e 50 -s 128 -v 10000 -a 1 --cifar -m 4 -R --bad-repr 4 -g 2.5274795875746927e-05
deepstrom -e 50 -s 128 -v 10000 -a 1 --cifar -m 8 -R --bad-repr 4 -g 2.5274795875746927e-05
deepstrom -e 50 -s 128 -v 10000 -a 1 --cifar -m 16 -R --bad-repr 4 -g 2.5274795875746927e-05
deepstrom -e 50 -s 128 -v 10000 -a 1 --cifar -m 32 -R --bad-repr 4 -g 2.5274795875746927e-05
deepstrom -e 50 -s 128 -v 10000 -a 1 --cifar -m 64 -R --bad-repr 4 -g 2.5274795875746927e-05
deepstrom -e 50 -s 128 -v 10000 -a 1 --cifar -m 128 -R --bad-repr 4 -g 2.5274795875746927e-05
deepstrom -e 50 -s 128 -v 10000 -a 2 --cifar -m 2 -R --bad-repr 4 -g 2.5274795875746927e-05
deepstrom -e 50 -s 128 -v 10000 -a 2 --cifar -m 4 -R --bad-repr 4 -g 2.5274795875746927e-05
deepstrom -e 50 -s 128 -v 10000 -a 2 --cifar -m 8 -R --bad-repr 4 -g 2.5274795875746927e-05
deepstrom -e 50 -s 128 -v 10000 -a 2 --cifar -m 16 -R --bad-repr 4 -g 2.5274795875746927e-05
deepstrom -e 50 -s 128 -v 10000 -a 2 --cifar -m 32 -R --bad-repr 4 -g 2.5274795875746927e-05
deepstrom -e 50 -s 128 -v 10000 -a 2 --cifar -m 64 -R --bad-repr 4 -g 2.5274795875746927e-05
deepstrom -e 50 -s 128 -v 10000 -a 2 --cifar -m 128 -R --bad-repr 4 -g 2.5274795875746927e-05
deepstrom -e 50 -s 128 -v 10000 -a 3 --cifar -m 2 -R --bad-repr 4 -g 2.5274795875746927e-05
deepstrom -e 50 -s 128 -v 10000 -a 3 --cifar -m 4 -R --bad-repr 4 -g 2.5274795875746927e-05
deepstrom -e 50 -s 128 -v 10000 -a 3 --cifar -m 8 -R --bad-repr 4 -g 2.5274795875746927e-05
deepstrom -e 50 -s 128 -v 10000 -a 3 --cifar -m 16 -R --bad-repr 4 -g 2.5274795875746927e-05
deepstrom -e 50 -s 128 -v 10000 -a 3 --cifar -m 32 -R --bad-repr 4 -g 2.5274795875746927e-05
deepstrom -e 50 -s 128 -v 10000 -a 3 --cifar -m 64 -R --bad-repr 4 -g 2.5274795875746927e-05
deepstrom -e 50 -s 128 -v 10000 -a 3 --cifar -m 128 -R --bad-repr 4 -g 2.5274795875746927e-05
deepstrom -e 50 -s 128 -v 10000 -a 4 --cifar -m 2 -R --bad-repr 4 -g 2.5274795875746927e-05
deepstrom -e 50 -s 128 -v 10000 -a 4 --cifar -m 4 -R --bad-repr 4 -g 2.5274795875746927e-05
deepstrom -e 50 -s 128 -v 10000 -a 4 --cifar -m 8 -R --bad-repr 4 -g 2.5274795875746927e-05
deepstrom -e 50 -s 128 -v 10000 -a 4 --cifar -m 16 -R --bad-repr 4 -g 2.5274795875746927e-05
deepstrom -e 50 -s 128 -v 10000 -a 4 --cifar -m 32 -R --bad-repr 4 -g 2.5274795875746927e-05
deepstrom -e 50 -s 128 -v 10000 -a 4 --cifar -m 64 -R --bad-repr 4 -g 2.5274795875746927e-05
deepstrom -e 50 -s 128 -v 10000 -a 4 --cifar -m 128 -R --bad-repr 4 -g 2.5274795875746927e-05
deepstrom -e 50 -s 128 -v 10000 -a 5 --cifar -m 2 -R --bad-repr 4 -g 2.5274795875746927e-05
deepstrom -e 50 -s 128 -v 10000 -a 5 --cifar -m 4 -R --bad-repr 4 -g 2.5274795875746927e-05
deepstrom -e 50 -s 128 -v 10000 -a 5 --cifar -m 8 -R --bad-repr 4 -g 2.5274795875746927e-05
deepstrom -e 50 -s 128 -v 10000 -a 5 --cifar -m 16 -R --bad-repr 4 -g 2.5274795875746927e-05
deepstrom -e 50 -s 128 -v 10000 -a 5 --cifar -m 32 -R --bad-repr 4 -g 2.5274795875746927e-05
deepstrom -e 50 -s 128 -v 10000 -a 5 --cifar -m 64 -R --bad-repr 4 -g 2.5274795875746927e-05
deepstrom -e 50 -s 128 -v 10000 -a 5 --cifar -m 128 -R --bad-repr 4 -g 2.5274795875746927e-05
deepstrom -e 50 -s 128 -v 10000 -a 6 --cifar -m 2 -R --bad-repr 4 -g 2.5274795875746927e-05
deepstrom -e 50 -s 128 -v 10000 -a 6 --cifar -m 4 -R --bad-repr 4 -g 2.5274795875746927e-05
deepstrom -e 50 -s 128 -v 10000 -a 6 --cifar -m 8 -R --bad-repr 4 -g 2.5274795875746927e-05
deepstrom -e 50 -s 128 -v 10000 -a 6 --cifar -m 16 -R --bad-repr 4 -g 2.5274795875746927e-05
deepstrom -e 50 -s 128 -v 10000 -a 6 --cifar -m 32 -R --bad-repr 4 -g 2.5274795875746927e-05
deepstrom -e 50 -s 128 -v 10000 -a 6 --cifar -m 64 -R --bad-repr 4 -g 2.5274795875746927e-05
deepstrom -e 50 -s 128 -v 10000 -a 6 --cifar -m 128 -R --bad-repr 4 -g 2.5274795875746927e-05
deepstrom -e 50 -s 128 -v 10000 -a 7 --cifar -m 2 -R --bad-repr 4 -g 2.5274795875746927e-05
deepstrom -e 50 -s 128 -v 10000 -a 7 --cifar -m 4 -R --bad-repr 4 -g 2.5274795875746927e-05
deepstrom -e 50 -s 128 -v 10000 -a 7 --cifar -m 8 -R --bad-repr 4 -g 2.5274795875746927e-05
deepstrom -e 50 -s 128 -v 10000 -a 7 --cifar -m 16 -R --bad-repr 4 -g 2.5274795875746927e-05
deepstrom -e 50 -s 128 -v 10000 -a 7 --cifar -m 32 -R --bad-repr 4 -g 2.5274795875746927e-05
deepstrom -e 50 -s 128 -v 10000 -a 7 --cifar -m 64 -R --bad-repr 4 -g 2.5274795875746927e-05
deepstrom -e 50 -s 128 -v 10000 -a 7 --cifar -m 128 -R --bad-repr 4 -g 2.5274795875746927e-05
deepstrom -e 50 -s 128 -v 10000 -a 8 --cifar -m 2 -R --bad-repr 4 -g 2.5274795875746927e-05
deepstrom -e 50 -s 128 -v 10000 -a 8 --cifar -m 4 -R --bad-repr 4 -g 2.5274795875746927e-05
deepstrom -e 50 -s 128 -v 10000 -a 8 --cifar -m 8 -R --bad-repr 4 -g 2.5274795875746927e-05
deepstrom -e 50 -s 128 -v 10000 -a 8 --cifar -m 16 -R --bad-repr 4 -g 2.5274795875746927e-05
deepstrom -e 50 -s 128 -v 10000 -a 8 --cifar -m 32 -R --bad-repr 4 -g 2.5274795875746927e-05
deepstrom -e 50 -s 128 -v 10000 -a 8 --cifar -m 64 -R --bad-repr 4 -g 2.5274795875746927e-05
deepstrom -e 50 -s 128 -v 10000 -a 8 --cifar -m 128 -R --bad-repr 4 -g 2.5274795875746927e-05
deepstrom -e 50 -s 128 -v 10000 -a 9 --cifar -m 2 -R --bad-repr 4 -g 2.5274795875746927e-05
deepstrom -e 50 -s 128 -v 10000 -a 9 --cifar -m 4 -R --bad-repr 4 -g 2.5274795875746927e-05
deepstrom -e 50 -s 128 -v 10000 -a 9 --cifar -m 8 -R --bad-repr 4 -g 2.5274795875746927e-05
deepstrom -e 50 -s 128 -v 10000 -a 9 --cifar -m 16 -R --bad-repr 4 -g 2.5274795875746927e-05
deepstrom -e 50 -s 128 -v 10000 -a 9 --cifar -m 32 -R --bad-repr 4 -g 2.5274795875746927e-05
deepstrom -e 50 -s 128 -v 10000 -a 9 --cifar -m 64 -R --bad-repr 4 -g 2.5274795875746927e-05
deepstrom -e 50 -s 128 -v 10000 -a 9 --cifar -m 128 -R --bad-repr 4 -g 2.5274795875746927e-05
