dense -e 50 -s 64 -v 10000 -a 0 -t 20 --svhn -D 16
dense -e 50 -s 64 -v 10000 -a 0 -t 20 --svhn -D 64
dense -e 50 -s 64 -v 10000 -a 0 -t 20 --svhn -D 128
dense -e 50 -s 64 -v 10000 -a 0 -t 20 --svhn -D 1024
dense -e 50 -s 64 -v 10000 -a 0 -t 50 --svhn -D 16
dense -e 50 -s 64 -v 10000 -a 0 -t 50 --svhn -D 64
dense -e 50 -s 64 -v 10000 -a 0 -t 50 --svhn -D 128
dense -e 50 -s 64 -v 10000 -a 0 -t 50 --svhn -D 1024
dense -e 50 -s 64 -v 10000 -a 0 -t 100 --svhn -D 16
dense -e 50 -s 64 -v 10000 -a 0 -t 100 --svhn -D 64
dense -e 50 -s 64 -v 10000 -a 0 -t 100 --svhn -D 128
dense -e 50 -s 64 -v 10000 -a 0 -t 100 --svhn -D 1024
dense -e 50 -s 64 -v 10000 -a 0 -t 200 --svhn -D 16
dense -e 50 -s 64 -v 10000 -a 0 -t 200 --svhn -D 64
dense -e 50 -s 64 -v 10000 -a 0 -t 200 --svhn -D 128
dense -e 50 -s 64 -v 10000 -a 0 -t 200 --svhn -D 1024
dense -e 50 -s 64 -v 10000 -a 0 -t 500 --svhn -D 16
dense -e 50 -s 64 -v 10000 -a 0 -t 500 --svhn -D 64
dense -e 50 -s 64 -v 10000 -a 0 -t 500 --svhn -D 128
dense -e 50 -s 64 -v 10000 -a 0 -t 500 --svhn -D 1024
dense -e 50 -s 64 -v 10000 -a 0 -t 1000 --svhn -D 16
dense -e 50 -s 64 -v 10000 -a 0 -t 1000 --svhn -D 64
dense -e 50 -s 64 -v 10000 -a 0 -t 1000 --svhn -D 128
dense -e 50 -s 64 -v 10000 -a 0 -t 1000 --svhn -D 1024
dense -e 50 -s 64 -v 10000 -a 0 -t 2000 --svhn -D 16
dense -e 50 -s 64 -v 10000 -a 0 -t 2000 --svhn -D 64
dense -e 50 -s 64 -v 10000 -a 0 -t 2000 --svhn -D 128
dense -e 50 -s 64 -v 10000 -a 0 -t 2000 --svhn -D 1024
dense -e 50 -s 64 -v 10000 -a 1 -t 20 --svhn -D 16
dense -e 50 -s 64 -v 10000 -a 1 -t 20 --svhn -D 64
dense -e 50 -s 64 -v 10000 -a 1 -t 20 --svhn -D 128
dense -e 50 -s 64 -v 10000 -a 1 -t 20 --svhn -D 1024
dense -e 50 -s 64 -v 10000 -a 1 -t 50 --svhn -D 16
dense -e 50 -s 64 -v 10000 -a 1 -t 50 --svhn -D 64
dense -e 50 -s 64 -v 10000 -a 1 -t 50 --svhn -D 128
dense -e 50 -s 64 -v 10000 -a 1 -t 50 --svhn -D 1024
dense -e 50 -s 64 -v 10000 -a 1 -t 100 --svhn -D 16
dense -e 50 -s 64 -v 10000 -a 1 -t 100 --svhn -D 64
dense -e 50 -s 64 -v 10000 -a 1 -t 100 --svhn -D 128
dense -e 50 -s 64 -v 10000 -a 1 -t 100 --svhn -D 1024
dense -e 50 -s 64 -v 10000 -a 1 -t 200 --svhn -D 16
dense -e 50 -s 64 -v 10000 -a 1 -t 200 --svhn -D 64
dense -e 50 -s 64 -v 10000 -a 1 -t 200 --svhn -D 128
dense -e 50 -s 64 -v 10000 -a 1 -t 200 --svhn -D 1024
dense -e 50 -s 64 -v 10000 -a 1 -t 500 --svhn -D 16
dense -e 50 -s 64 -v 10000 -a 1 -t 500 --svhn -D 64
dense -e 50 -s 64 -v 10000 -a 1 -t 500 --svhn -D 128
dense -e 50 -s 64 -v 10000 -a 1 -t 500 --svhn -D 1024
dense -e 50 -s 64 -v 10000 -a 1 -t 1000 --svhn -D 16
dense -e 50 -s 64 -v 10000 -a 1 -t 1000 --svhn -D 64
dense -e 50 -s 64 -v 10000 -a 1 -t 1000 --svhn -D 128
dense -e 50 -s 64 -v 10000 -a 1 -t 1000 --svhn -D 1024
dense -e 50 -s 64 -v 10000 -a 1 -t 2000 --svhn -D 16
dense -e 50 -s 64 -v 10000 -a 1 -t 2000 --svhn -D 64
dense -e 50 -s 64 -v 10000 -a 1 -t 2000 --svhn -D 128
dense -e 50 -s 64 -v 10000 -a 1 -t 2000 --svhn -D 1024
dense -e 50 -s 64 -v 10000 -a 2 -t 20 --svhn -D 16
dense -e 50 -s 64 -v 10000 -a 2 -t 20 --svhn -D 64
dense -e 50 -s 64 -v 10000 -a 2 -t 20 --svhn -D 128
dense -e 50 -s 64 -v 10000 -a 2 -t 20 --svhn -D 1024
dense -e 50 -s 64 -v 10000 -a 2 -t 50 --svhn -D 16
dense -e 50 -s 64 -v 10000 -a 2 -t 50 --svhn -D 64
dense -e 50 -s 64 -v 10000 -a 2 -t 50 --svhn -D 128
dense -e 50 -s 64 -v 10000 -a 2 -t 50 --svhn -D 1024
dense -e 50 -s 64 -v 10000 -a 2 -t 100 --svhn -D 16
dense -e 50 -s 64 -v 10000 -a 2 -t 100 --svhn -D 64
dense -e 50 -s 64 -v 10000 -a 2 -t 100 --svhn -D 128
dense -e 50 -s 64 -v 10000 -a 2 -t 100 --svhn -D 1024
dense -e 50 -s 64 -v 10000 -a 2 -t 200 --svhn -D 16
dense -e 50 -s 64 -v 10000 -a 2 -t 200 --svhn -D 64
dense -e 50 -s 64 -v 10000 -a 2 -t 200 --svhn -D 128
dense -e 50 -s 64 -v 10000 -a 2 -t 200 --svhn -D 1024
dense -e 50 -s 64 -v 10000 -a 2 -t 500 --svhn -D 16
dense -e 50 -s 64 -v 10000 -a 2 -t 500 --svhn -D 64
dense -e 50 -s 64 -v 10000 -a 2 -t 500 --svhn -D 128
dense -e 50 -s 64 -v 10000 -a 2 -t 500 --svhn -D 1024
dense -e 50 -s 64 -v 10000 -a 2 -t 1000 --svhn -D 16
dense -e 50 -s 64 -v 10000 -a 2 -t 1000 --svhn -D 64
dense -e 50 -s 64 -v 10000 -a 2 -t 1000 --svhn -D 128
dense -e 50 -s 64 -v 10000 -a 2 -t 1000 --svhn -D 1024
dense -e 50 -s 64 -v 10000 -a 2 -t 2000 --svhn -D 16
dense -e 50 -s 64 -v 10000 -a 2 -t 2000 --svhn -D 64
dense -e 50 -s 64 -v 10000 -a 2 -t 2000 --svhn -D 128
dense -e 50 -s 64 -v 10000 -a 2 -t 2000 --svhn -D 1024
deepfriedconvnet -e 50 -s 64 -v 10000 -a 0 -t 20 --svhn -g 0.0025145440260884045 -N 1
deepfriedconvnet -e 50 -s 64 -v 10000 -a 0 -t 50 --svhn -g 0.0025145440260884045 -N 1
deepfriedconvnet -e 50 -s 64 -v 10000 -a 0 -t 100 --svhn -g 0.0025145440260884045 -N 1
deepfriedconvnet -e 50 -s 64 -v 10000 -a 0 -t 200 --svhn -g 0.0025145440260884045 -N 1
deepfriedconvnet -e 50 -s 64 -v 10000 -a 0 -t 500 --svhn -g 0.0025145440260884045 -N 1
deepfriedconvnet -e 50 -s 64 -v 10000 -a 0 -t 1000 --svhn -g 0.0025145440260884045 -N 1
deepfriedconvnet -e 50 -s 64 -v 10000 -a 0 -t 2000 --svhn -g 0.0025145440260884045 -N 1
deepfriedconvnet -e 50 -s 64 -v 10000 -a 1 -t 20 --svhn -g 0.0025145440260884045 -N 1
deepfriedconvnet -e 50 -s 64 -v 10000 -a 1 -t 50 --svhn -g 0.0025145440260884045 -N 1
deepfriedconvnet -e 50 -s 64 -v 10000 -a 1 -t 100 --svhn -g 0.0025145440260884045 -N 1
deepfriedconvnet -e 50 -s 64 -v 10000 -a 1 -t 200 --svhn -g 0.0025145440260884045 -N 1
deepfriedconvnet -e 50 -s 64 -v 10000 -a 1 -t 500 --svhn -g 0.0025145440260884045 -N 1
deepfriedconvnet -e 50 -s 64 -v 10000 -a 1 -t 1000 --svhn -g 0.0025145440260884045 -N 1
deepfriedconvnet -e 50 -s 64 -v 10000 -a 1 -t 2000 --svhn -g 0.0025145440260884045 -N 1
deepfriedconvnet -e 50 -s 64 -v 10000 -a 2 -t 20 --svhn -g 0.0025145440260884045 -N 1
deepfriedconvnet -e 50 -s 64 -v 10000 -a 2 -t 50 --svhn -g 0.0025145440260884045 -N 1
deepfriedconvnet -e 50 -s 64 -v 10000 -a 2 -t 100 --svhn -g 0.0025145440260884045 -N 1
deepfriedconvnet -e 50 -s 64 -v 10000 -a 2 -t 200 --svhn -g 0.0025145440260884045 -N 1
deepfriedconvnet -e 50 -s 64 -v 10000 -a 2 -t 500 --svhn -g 0.0025145440260884045 -N 1
deepfriedconvnet -e 50 -s 64 -v 10000 -a 2 -t 1000 --svhn -g 0.0025145440260884045 -N 1
deepfriedconvnet -e 50 -s 64 -v 10000 -a 2 -t 2000 --svhn -g 0.0025145440260884045 -N 1
deepstrom -e 50 -s 64 -v 10000 -a 0 -t 20 --svhn -m 16 -r -g 0.0025145440260884045 -R
deepstrom -e 50 -s 64 -v 10000 -a 0 -t 20 --svhn -m 64 -r -g 0.0025145440260884045 -R
deepstrom -e 50 -s 64 -v 10000 -a 0 -t 20 --svhn -m 128 -r -g 0.0025145440260884045 -R
deepstrom -e 50 -s 64 -v 10000 -a 0 -t 20 --svhn -m 256 -r -g 0.0025145440260884045 -R
deepstrom -e 50 -s 64 -v 10000 -a 0 -t 20 --svhn -m 512 -r -g 0.0025145440260884045 -R
deepstrom -e 50 -s 64 -v 10000 -a 0 -t 20 --svhn -m 1024 -r -g 0.0025145440260884045 -R
deepstrom -e 50 -s 64 -v 10000 -a 0 -t 50 --svhn -m 16 -r -g 0.0025145440260884045 -R
deepstrom -e 50 -s 64 -v 10000 -a 0 -t 50 --svhn -m 64 -r -g 0.0025145440260884045 -R
deepstrom -e 50 -s 64 -v 10000 -a 0 -t 50 --svhn -m 128 -r -g 0.0025145440260884045 -R
deepstrom -e 50 -s 64 -v 10000 -a 0 -t 50 --svhn -m 256 -r -g 0.0025145440260884045 -R
deepstrom -e 50 -s 64 -v 10000 -a 0 -t 50 --svhn -m 512 -r -g 0.0025145440260884045 -R
deepstrom -e 50 -s 64 -v 10000 -a 0 -t 50 --svhn -m 1024 -r -g 0.0025145440260884045 -R
deepstrom -e 50 -s 64 -v 10000 -a 0 -t 100 --svhn -m 16 -r -g 0.0025145440260884045 -R
deepstrom -e 50 -s 64 -v 10000 -a 0 -t 100 --svhn -m 64 -r -g 0.0025145440260884045 -R
deepstrom -e 50 -s 64 -v 10000 -a 0 -t 100 --svhn -m 128 -r -g 0.0025145440260884045 -R
deepstrom -e 50 -s 64 -v 10000 -a 0 -t 100 --svhn -m 256 -r -g 0.0025145440260884045 -R
deepstrom -e 50 -s 64 -v 10000 -a 0 -t 100 --svhn -m 512 -r -g 0.0025145440260884045 -R
deepstrom -e 50 -s 64 -v 10000 -a 0 -t 100 --svhn -m 1024 -r -g 0.0025145440260884045 -R
deepstrom -e 50 -s 64 -v 10000 -a 0 -t 200 --svhn -m 16 -r -g 0.0025145440260884045 -R
deepstrom -e 50 -s 64 -v 10000 -a 0 -t 200 --svhn -m 64 -r -g 0.0025145440260884045 -R
deepstrom -e 50 -s 64 -v 10000 -a 0 -t 200 --svhn -m 128 -r -g 0.0025145440260884045 -R
deepstrom -e 50 -s 64 -v 10000 -a 0 -t 200 --svhn -m 256 -r -g 0.0025145440260884045 -R
deepstrom -e 50 -s 64 -v 10000 -a 0 -t 200 --svhn -m 512 -r -g 0.0025145440260884045 -R
deepstrom -e 50 -s 64 -v 10000 -a 0 -t 200 --svhn -m 1024 -r -g 0.0025145440260884045 -R
deepstrom -e 50 -s 64 -v 10000 -a 0 -t 500 --svhn -m 16 -r -g 0.0025145440260884045 -R
deepstrom -e 50 -s 64 -v 10000 -a 0 -t 500 --svhn -m 64 -r -g 0.0025145440260884045 -R
deepstrom -e 50 -s 64 -v 10000 -a 0 -t 500 --svhn -m 128 -r -g 0.0025145440260884045 -R
deepstrom -e 50 -s 64 -v 10000 -a 0 -t 500 --svhn -m 256 -r -g 0.0025145440260884045 -R
deepstrom -e 50 -s 64 -v 10000 -a 0 -t 500 --svhn -m 512 -r -g 0.0025145440260884045 -R
deepstrom -e 50 -s 64 -v 10000 -a 0 -t 500 --svhn -m 1024 -r -g 0.0025145440260884045 -R
deepstrom -e 50 -s 64 -v 10000 -a 0 -t 1000 --svhn -m 16 -r -g 0.0025145440260884045 -R
deepstrom -e 50 -s 64 -v 10000 -a 0 -t 1000 --svhn -m 64 -r -g 0.0025145440260884045 -R
deepstrom -e 50 -s 64 -v 10000 -a 0 -t 1000 --svhn -m 128 -r -g 0.0025145440260884045 -R
deepstrom -e 50 -s 64 -v 10000 -a 0 -t 1000 --svhn -m 256 -r -g 0.0025145440260884045 -R
deepstrom -e 50 -s 64 -v 10000 -a 0 -t 1000 --svhn -m 512 -r -g 0.0025145440260884045 -R
deepstrom -e 50 -s 64 -v 10000 -a 0 -t 1000 --svhn -m 1024 -r -g 0.0025145440260884045 -R
deepstrom -e 50 -s 64 -v 10000 -a 0 -t 2000 --svhn -m 16 -r -g 0.0025145440260884045 -R
deepstrom -e 50 -s 64 -v 10000 -a 0 -t 2000 --svhn -m 64 -r -g 0.0025145440260884045 -R
deepstrom -e 50 -s 64 -v 10000 -a 0 -t 2000 --svhn -m 128 -r -g 0.0025145440260884045 -R
deepstrom -e 50 -s 64 -v 10000 -a 0 -t 2000 --svhn -m 256 -r -g 0.0025145440260884045 -R
deepstrom -e 50 -s 64 -v 10000 -a 0 -t 2000 --svhn -m 512 -r -g 0.0025145440260884045 -R
deepstrom -e 50 -s 64 -v 10000 -a 0 -t 2000 --svhn -m 1024 -r -g 0.0025145440260884045 -R
deepstrom -e 50 -s 64 -v 10000 -a 1 -t 20 --svhn -m 16 -r -g 0.0025145440260884045 -R
deepstrom -e 50 -s 64 -v 10000 -a 1 -t 20 --svhn -m 64 -r -g 0.0025145440260884045 -R
deepstrom -e 50 -s 64 -v 10000 -a 1 -t 20 --svhn -m 128 -r -g 0.0025145440260884045 -R
deepstrom -e 50 -s 64 -v 10000 -a 1 -t 20 --svhn -m 256 -r -g 0.0025145440260884045 -R
deepstrom -e 50 -s 64 -v 10000 -a 1 -t 20 --svhn -m 512 -r -g 0.0025145440260884045 -R
deepstrom -e 50 -s 64 -v 10000 -a 1 -t 20 --svhn -m 1024 -r -g 0.0025145440260884045 -R
deepstrom -e 50 -s 64 -v 10000 -a 1 -t 50 --svhn -m 16 -r -g 0.0025145440260884045 -R
deepstrom -e 50 -s 64 -v 10000 -a 1 -t 50 --svhn -m 64 -r -g 0.0025145440260884045 -R
deepstrom -e 50 -s 64 -v 10000 -a 1 -t 50 --svhn -m 128 -r -g 0.0025145440260884045 -R
deepstrom -e 50 -s 64 -v 10000 -a 1 -t 50 --svhn -m 256 -r -g 0.0025145440260884045 -R
deepstrom -e 50 -s 64 -v 10000 -a 1 -t 50 --svhn -m 512 -r -g 0.0025145440260884045 -R
deepstrom -e 50 -s 64 -v 10000 -a 1 -t 50 --svhn -m 1024 -r -g 0.0025145440260884045 -R
deepstrom -e 50 -s 64 -v 10000 -a 1 -t 100 --svhn -m 16 -r -g 0.0025145440260884045 -R
deepstrom -e 50 -s 64 -v 10000 -a 1 -t 100 --svhn -m 64 -r -g 0.0025145440260884045 -R
deepstrom -e 50 -s 64 -v 10000 -a 1 -t 100 --svhn -m 128 -r -g 0.0025145440260884045 -R
deepstrom -e 50 -s 64 -v 10000 -a 1 -t 100 --svhn -m 256 -r -g 0.0025145440260884045 -R
deepstrom -e 50 -s 64 -v 10000 -a 1 -t 100 --svhn -m 512 -r -g 0.0025145440260884045 -R
deepstrom -e 50 -s 64 -v 10000 -a 1 -t 100 --svhn -m 1024 -r -g 0.0025145440260884045 -R
deepstrom -e 50 -s 64 -v 10000 -a 1 -t 200 --svhn -m 16 -r -g 0.0025145440260884045 -R
deepstrom -e 50 -s 64 -v 10000 -a 1 -t 200 --svhn -m 64 -r -g 0.0025145440260884045 -R
deepstrom -e 50 -s 64 -v 10000 -a 1 -t 200 --svhn -m 128 -r -g 0.0025145440260884045 -R
deepstrom -e 50 -s 64 -v 10000 -a 1 -t 200 --svhn -m 256 -r -g 0.0025145440260884045 -R
deepstrom -e 50 -s 64 -v 10000 -a 1 -t 200 --svhn -m 512 -r -g 0.0025145440260884045 -R
deepstrom -e 50 -s 64 -v 10000 -a 1 -t 200 --svhn -m 1024 -r -g 0.0025145440260884045 -R
deepstrom -e 50 -s 64 -v 10000 -a 1 -t 500 --svhn -m 16 -r -g 0.0025145440260884045 -R
deepstrom -e 50 -s 64 -v 10000 -a 1 -t 500 --svhn -m 64 -r -g 0.0025145440260884045 -R
deepstrom -e 50 -s 64 -v 10000 -a 1 -t 500 --svhn -m 128 -r -g 0.0025145440260884045 -R
deepstrom -e 50 -s 64 -v 10000 -a 1 -t 500 --svhn -m 256 -r -g 0.0025145440260884045 -R
deepstrom -e 50 -s 64 -v 10000 -a 1 -t 500 --svhn -m 512 -r -g 0.0025145440260884045 -R
deepstrom -e 50 -s 64 -v 10000 -a 1 -t 500 --svhn -m 1024 -r -g 0.0025145440260884045 -R
deepstrom -e 50 -s 64 -v 10000 -a 1 -t 1000 --svhn -m 16 -r -g 0.0025145440260884045 -R
deepstrom -e 50 -s 64 -v 10000 -a 1 -t 1000 --svhn -m 64 -r -g 0.0025145440260884045 -R
deepstrom -e 50 -s 64 -v 10000 -a 1 -t 1000 --svhn -m 128 -r -g 0.0025145440260884045 -R
deepstrom -e 50 -s 64 -v 10000 -a 1 -t 1000 --svhn -m 256 -r -g 0.0025145440260884045 -R
deepstrom -e 50 -s 64 -v 10000 -a 1 -t 1000 --svhn -m 512 -r -g 0.0025145440260884045 -R
deepstrom -e 50 -s 64 -v 10000 -a 1 -t 1000 --svhn -m 1024 -r -g 0.0025145440260884045 -R
deepstrom -e 50 -s 64 -v 10000 -a 1 -t 2000 --svhn -m 16 -r -g 0.0025145440260884045 -R
deepstrom -e 50 -s 64 -v 10000 -a 1 -t 2000 --svhn -m 64 -r -g 0.0025145440260884045 -R
deepstrom -e 50 -s 64 -v 10000 -a 1 -t 2000 --svhn -m 128 -r -g 0.0025145440260884045 -R
deepstrom -e 50 -s 64 -v 10000 -a 1 -t 2000 --svhn -m 256 -r -g 0.0025145440260884045 -R
deepstrom -e 50 -s 64 -v 10000 -a 1 -t 2000 --svhn -m 512 -r -g 0.0025145440260884045 -R
deepstrom -e 50 -s 64 -v 10000 -a 1 -t 2000 --svhn -m 1024 -r -g 0.0025145440260884045 -R
deepstrom -e 50 -s 64 -v 10000 -a 2 -t 20 --svhn -m 16 -r -g 0.0025145440260884045 -R
deepstrom -e 50 -s 64 -v 10000 -a 2 -t 20 --svhn -m 64 -r -g 0.0025145440260884045 -R
deepstrom -e 50 -s 64 -v 10000 -a 2 -t 20 --svhn -m 128 -r -g 0.0025145440260884045 -R
deepstrom -e 50 -s 64 -v 10000 -a 2 -t 20 --svhn -m 256 -r -g 0.0025145440260884045 -R
deepstrom -e 50 -s 64 -v 10000 -a 2 -t 20 --svhn -m 512 -r -g 0.0025145440260884045 -R
deepstrom -e 50 -s 64 -v 10000 -a 2 -t 20 --svhn -m 1024 -r -g 0.0025145440260884045 -R
deepstrom -e 50 -s 64 -v 10000 -a 2 -t 50 --svhn -m 16 -r -g 0.0025145440260884045 -R
deepstrom -e 50 -s 64 -v 10000 -a 2 -t 50 --svhn -m 64 -r -g 0.0025145440260884045 -R
deepstrom -e 50 -s 64 -v 10000 -a 2 -t 50 --svhn -m 128 -r -g 0.0025145440260884045 -R
deepstrom -e 50 -s 64 -v 10000 -a 2 -t 50 --svhn -m 256 -r -g 0.0025145440260884045 -R
deepstrom -e 50 -s 64 -v 10000 -a 2 -t 50 --svhn -m 512 -r -g 0.0025145440260884045 -R
deepstrom -e 50 -s 64 -v 10000 -a 2 -t 50 --svhn -m 1024 -r -g 0.0025145440260884045 -R
deepstrom -e 50 -s 64 -v 10000 -a 2 -t 100 --svhn -m 16 -r -g 0.0025145440260884045 -R
deepstrom -e 50 -s 64 -v 10000 -a 2 -t 100 --svhn -m 64 -r -g 0.0025145440260884045 -R
deepstrom -e 50 -s 64 -v 10000 -a 2 -t 100 --svhn -m 128 -r -g 0.0025145440260884045 -R
deepstrom -e 50 -s 64 -v 10000 -a 2 -t 100 --svhn -m 256 -r -g 0.0025145440260884045 -R
deepstrom -e 50 -s 64 -v 10000 -a 2 -t 100 --svhn -m 512 -r -g 0.0025145440260884045 -R
deepstrom -e 50 -s 64 -v 10000 -a 2 -t 100 --svhn -m 1024 -r -g 0.0025145440260884045 -R
deepstrom -e 50 -s 64 -v 10000 -a 2 -t 200 --svhn -m 16 -r -g 0.0025145440260884045 -R
deepstrom -e 50 -s 64 -v 10000 -a 2 -t 200 --svhn -m 64 -r -g 0.0025145440260884045 -R
deepstrom -e 50 -s 64 -v 10000 -a 2 -t 200 --svhn -m 128 -r -g 0.0025145440260884045 -R
deepstrom -e 50 -s 64 -v 10000 -a 2 -t 200 --svhn -m 256 -r -g 0.0025145440260884045 -R
deepstrom -e 50 -s 64 -v 10000 -a 2 -t 200 --svhn -m 512 -r -g 0.0025145440260884045 -R
deepstrom -e 50 -s 64 -v 10000 -a 2 -t 200 --svhn -m 1024 -r -g 0.0025145440260884045 -R
deepstrom -e 50 -s 64 -v 10000 -a 2 -t 500 --svhn -m 16 -r -g 0.0025145440260884045 -R
deepstrom -e 50 -s 64 -v 10000 -a 2 -t 500 --svhn -m 64 -r -g 0.0025145440260884045 -R
deepstrom -e 50 -s 64 -v 10000 -a 2 -t 500 --svhn -m 128 -r -g 0.0025145440260884045 -R
deepstrom -e 50 -s 64 -v 10000 -a 2 -t 500 --svhn -m 256 -r -g 0.0025145440260884045 -R
deepstrom -e 50 -s 64 -v 10000 -a 2 -t 500 --svhn -m 512 -r -g 0.0025145440260884045 -R
deepstrom -e 50 -s 64 -v 10000 -a 2 -t 500 --svhn -m 1024 -r -g 0.0025145440260884045 -R
deepstrom -e 50 -s 64 -v 10000 -a 2 -t 1000 --svhn -m 16 -r -g 0.0025145440260884045 -R
deepstrom -e 50 -s 64 -v 10000 -a 2 -t 1000 --svhn -m 64 -r -g 0.0025145440260884045 -R
deepstrom -e 50 -s 64 -v 10000 -a 2 -t 1000 --svhn -m 128 -r -g 0.0025145440260884045 -R
deepstrom -e 50 -s 64 -v 10000 -a 2 -t 1000 --svhn -m 256 -r -g 0.0025145440260884045 -R
deepstrom -e 50 -s 64 -v 10000 -a 2 -t 1000 --svhn -m 512 -r -g 0.0025145440260884045 -R
deepstrom -e 50 -s 64 -v 10000 -a 2 -t 1000 --svhn -m 1024 -r -g 0.0025145440260884045 -R
deepstrom -e 50 -s 64 -v 10000 -a 2 -t 2000 --svhn -m 16 -r -g 0.0025145440260884045 -R
deepstrom -e 50 -s 64 -v 10000 -a 2 -t 2000 --svhn -m 64 -r -g 0.0025145440260884045 -R
deepstrom -e 50 -s 64 -v 10000 -a 2 -t 2000 --svhn -m 128 -r -g 0.0025145440260884045 -R
deepstrom -e 50 -s 64 -v 10000 -a 2 -t 2000 --svhn -m 256 -r -g 0.0025145440260884045 -R
deepstrom -e 50 -s 64 -v 10000 -a 2 -t 2000 --svhn -m 512 -r -g 0.0025145440260884045 -R
deepstrom -e 50 -s 64 -v 10000 -a 2 -t 2000 --svhn -m 1024 -r -g 0.0025145440260884045 -R
deepstrom -e 50 -s 64 -v 10000 -a 0 -t 20 --svhn -m 16 -r -C
deepstrom -e 50 -s 64 -v 10000 -a 0 -t 20 --svhn -m 16 -r -L
deepstrom -e 50 -s 64 -v 10000 -a 0 -t 20 --svhn -m 64 -r -C
deepstrom -e 50 -s 64 -v 10000 -a 0 -t 20 --svhn -m 64 -r -L
deepstrom -e 50 -s 64 -v 10000 -a 0 -t 20 --svhn -m 128 -r -C
deepstrom -e 50 -s 64 -v 10000 -a 0 -t 20 --svhn -m 128 -r -L
deepstrom -e 50 -s 64 -v 10000 -a 0 -t 20 --svhn -m 256 -r -C
deepstrom -e 50 -s 64 -v 10000 -a 0 -t 20 --svhn -m 256 -r -L
deepstrom -e 50 -s 64 -v 10000 -a 0 -t 20 --svhn -m 512 -r -C
deepstrom -e 50 -s 64 -v 10000 -a 0 -t 20 --svhn -m 512 -r -L
deepstrom -e 50 -s 64 -v 10000 -a 0 -t 20 --svhn -m 1024 -r -C
deepstrom -e 50 -s 64 -v 10000 -a 0 -t 20 --svhn -m 1024 -r -L
deepstrom -e 50 -s 64 -v 10000 -a 0 -t 50 --svhn -m 16 -r -C
deepstrom -e 50 -s 64 -v 10000 -a 0 -t 50 --svhn -m 16 -r -L
deepstrom -e 50 -s 64 -v 10000 -a 0 -t 50 --svhn -m 64 -r -C
deepstrom -e 50 -s 64 -v 10000 -a 0 -t 50 --svhn -m 64 -r -L
deepstrom -e 50 -s 64 -v 10000 -a 0 -t 50 --svhn -m 128 -r -C
deepstrom -e 50 -s 64 -v 10000 -a 0 -t 50 --svhn -m 128 -r -L
deepstrom -e 50 -s 64 -v 10000 -a 0 -t 50 --svhn -m 256 -r -C
deepstrom -e 50 -s 64 -v 10000 -a 0 -t 50 --svhn -m 256 -r -L
deepstrom -e 50 -s 64 -v 10000 -a 0 -t 50 --svhn -m 512 -r -C
deepstrom -e 50 -s 64 -v 10000 -a 0 -t 50 --svhn -m 512 -r -L
deepstrom -e 50 -s 64 -v 10000 -a 0 -t 50 --svhn -m 1024 -r -C
deepstrom -e 50 -s 64 -v 10000 -a 0 -t 50 --svhn -m 1024 -r -L
deepstrom -e 50 -s 64 -v 10000 -a 0 -t 100 --svhn -m 16 -r -C
deepstrom -e 50 -s 64 -v 10000 -a 0 -t 100 --svhn -m 16 -r -L
deepstrom -e 50 -s 64 -v 10000 -a 0 -t 100 --svhn -m 64 -r -C
deepstrom -e 50 -s 64 -v 10000 -a 0 -t 100 --svhn -m 64 -r -L
deepstrom -e 50 -s 64 -v 10000 -a 0 -t 100 --svhn -m 128 -r -C
deepstrom -e 50 -s 64 -v 10000 -a 0 -t 100 --svhn -m 128 -r -L
deepstrom -e 50 -s 64 -v 10000 -a 0 -t 100 --svhn -m 256 -r -C
deepstrom -e 50 -s 64 -v 10000 -a 0 -t 100 --svhn -m 256 -r -L
deepstrom -e 50 -s 64 -v 10000 -a 0 -t 100 --svhn -m 512 -r -C
deepstrom -e 50 -s 64 -v 10000 -a 0 -t 100 --svhn -m 512 -r -L
deepstrom -e 50 -s 64 -v 10000 -a 0 -t 100 --svhn -m 1024 -r -C
deepstrom -e 50 -s 64 -v 10000 -a 0 -t 100 --svhn -m 1024 -r -L
deepstrom -e 50 -s 64 -v 10000 -a 0 -t 200 --svhn -m 16 -r -C
deepstrom -e 50 -s 64 -v 10000 -a 0 -t 200 --svhn -m 16 -r -L
deepstrom -e 50 -s 64 -v 10000 -a 0 -t 200 --svhn -m 64 -r -C
deepstrom -e 50 -s 64 -v 10000 -a 0 -t 200 --svhn -m 64 -r -L
deepstrom -e 50 -s 64 -v 10000 -a 0 -t 200 --svhn -m 128 -r -C
deepstrom -e 50 -s 64 -v 10000 -a 0 -t 200 --svhn -m 128 -r -L
deepstrom -e 50 -s 64 -v 10000 -a 0 -t 200 --svhn -m 256 -r -C
deepstrom -e 50 -s 64 -v 10000 -a 0 -t 200 --svhn -m 256 -r -L
deepstrom -e 50 -s 64 -v 10000 -a 0 -t 200 --svhn -m 512 -r -C
deepstrom -e 50 -s 64 -v 10000 -a 0 -t 200 --svhn -m 512 -r -L
deepstrom -e 50 -s 64 -v 10000 -a 0 -t 200 --svhn -m 1024 -r -C
deepstrom -e 50 -s 64 -v 10000 -a 0 -t 200 --svhn -m 1024 -r -L
deepstrom -e 50 -s 64 -v 10000 -a 0 -t 500 --svhn -m 16 -r -C
deepstrom -e 50 -s 64 -v 10000 -a 0 -t 500 --svhn -m 16 -r -L
deepstrom -e 50 -s 64 -v 10000 -a 0 -t 500 --svhn -m 64 -r -C
deepstrom -e 50 -s 64 -v 10000 -a 0 -t 500 --svhn -m 64 -r -L
deepstrom -e 50 -s 64 -v 10000 -a 0 -t 500 --svhn -m 128 -r -C
deepstrom -e 50 -s 64 -v 10000 -a 0 -t 500 --svhn -m 128 -r -L
deepstrom -e 50 -s 64 -v 10000 -a 0 -t 500 --svhn -m 256 -r -C
deepstrom -e 50 -s 64 -v 10000 -a 0 -t 500 --svhn -m 256 -r -L
deepstrom -e 50 -s 64 -v 10000 -a 0 -t 500 --svhn -m 512 -r -C
deepstrom -e 50 -s 64 -v 10000 -a 0 -t 500 --svhn -m 512 -r -L
deepstrom -e 50 -s 64 -v 10000 -a 0 -t 500 --svhn -m 1024 -r -C
deepstrom -e 50 -s 64 -v 10000 -a 0 -t 500 --svhn -m 1024 -r -L
deepstrom -e 50 -s 64 -v 10000 -a 0 -t 1000 --svhn -m 16 -r -C
deepstrom -e 50 -s 64 -v 10000 -a 0 -t 1000 --svhn -m 16 -r -L
deepstrom -e 50 -s 64 -v 10000 -a 0 -t 1000 --svhn -m 64 -r -C
deepstrom -e 50 -s 64 -v 10000 -a 0 -t 1000 --svhn -m 64 -r -L
deepstrom -e 50 -s 64 -v 10000 -a 0 -t 1000 --svhn -m 128 -r -C
deepstrom -e 50 -s 64 -v 10000 -a 0 -t 1000 --svhn -m 128 -r -L
deepstrom -e 50 -s 64 -v 10000 -a 0 -t 1000 --svhn -m 256 -r -C
deepstrom -e 50 -s 64 -v 10000 -a 0 -t 1000 --svhn -m 256 -r -L
deepstrom -e 50 -s 64 -v 10000 -a 0 -t 1000 --svhn -m 512 -r -C
deepstrom -e 50 -s 64 -v 10000 -a 0 -t 1000 --svhn -m 512 -r -L
deepstrom -e 50 -s 64 -v 10000 -a 0 -t 1000 --svhn -m 1024 -r -C
deepstrom -e 50 -s 64 -v 10000 -a 0 -t 1000 --svhn -m 1024 -r -L
deepstrom -e 50 -s 64 -v 10000 -a 0 -t 2000 --svhn -m 16 -r -C
deepstrom -e 50 -s 64 -v 10000 -a 0 -t 2000 --svhn -m 16 -r -L
deepstrom -e 50 -s 64 -v 10000 -a 0 -t 2000 --svhn -m 64 -r -C
deepstrom -e 50 -s 64 -v 10000 -a 0 -t 2000 --svhn -m 64 -r -L
deepstrom -e 50 -s 64 -v 10000 -a 0 -t 2000 --svhn -m 128 -r -C
deepstrom -e 50 -s 64 -v 10000 -a 0 -t 2000 --svhn -m 128 -r -L
deepstrom -e 50 -s 64 -v 10000 -a 0 -t 2000 --svhn -m 256 -r -C
deepstrom -e 50 -s 64 -v 10000 -a 0 -t 2000 --svhn -m 256 -r -L
deepstrom -e 50 -s 64 -v 10000 -a 0 -t 2000 --svhn -m 512 -r -C
deepstrom -e 50 -s 64 -v 10000 -a 0 -t 2000 --svhn -m 512 -r -L
deepstrom -e 50 -s 64 -v 10000 -a 0 -t 2000 --svhn -m 1024 -r -C
deepstrom -e 50 -s 64 -v 10000 -a 0 -t 2000 --svhn -m 1024 -r -L
deepstrom -e 50 -s 64 -v 10000 -a 1 -t 20 --svhn -m 16 -r -C
deepstrom -e 50 -s 64 -v 10000 -a 1 -t 20 --svhn -m 16 -r -L
deepstrom -e 50 -s 64 -v 10000 -a 1 -t 20 --svhn -m 64 -r -C
deepstrom -e 50 -s 64 -v 10000 -a 1 -t 20 --svhn -m 64 -r -L
deepstrom -e 50 -s 64 -v 10000 -a 1 -t 20 --svhn -m 128 -r -C
deepstrom -e 50 -s 64 -v 10000 -a 1 -t 20 --svhn -m 128 -r -L
deepstrom -e 50 -s 64 -v 10000 -a 1 -t 20 --svhn -m 256 -r -C
deepstrom -e 50 -s 64 -v 10000 -a 1 -t 20 --svhn -m 256 -r -L
deepstrom -e 50 -s 64 -v 10000 -a 1 -t 20 --svhn -m 512 -r -C
deepstrom -e 50 -s 64 -v 10000 -a 1 -t 20 --svhn -m 512 -r -L
deepstrom -e 50 -s 64 -v 10000 -a 1 -t 20 --svhn -m 1024 -r -C
deepstrom -e 50 -s 64 -v 10000 -a 1 -t 20 --svhn -m 1024 -r -L
deepstrom -e 50 -s 64 -v 10000 -a 1 -t 50 --svhn -m 16 -r -C
deepstrom -e 50 -s 64 -v 10000 -a 1 -t 50 --svhn -m 16 -r -L
deepstrom -e 50 -s 64 -v 10000 -a 1 -t 50 --svhn -m 64 -r -C
deepstrom -e 50 -s 64 -v 10000 -a 1 -t 50 --svhn -m 64 -r -L
deepstrom -e 50 -s 64 -v 10000 -a 1 -t 50 --svhn -m 128 -r -C
deepstrom -e 50 -s 64 -v 10000 -a 1 -t 50 --svhn -m 128 -r -L
deepstrom -e 50 -s 64 -v 10000 -a 1 -t 50 --svhn -m 256 -r -C
deepstrom -e 50 -s 64 -v 10000 -a 1 -t 50 --svhn -m 256 -r -L
deepstrom -e 50 -s 64 -v 10000 -a 1 -t 50 --svhn -m 512 -r -C
deepstrom -e 50 -s 64 -v 10000 -a 1 -t 50 --svhn -m 512 -r -L
deepstrom -e 50 -s 64 -v 10000 -a 1 -t 50 --svhn -m 1024 -r -C
deepstrom -e 50 -s 64 -v 10000 -a 1 -t 50 --svhn -m 1024 -r -L
deepstrom -e 50 -s 64 -v 10000 -a 1 -t 100 --svhn -m 16 -r -C
deepstrom -e 50 -s 64 -v 10000 -a 1 -t 100 --svhn -m 16 -r -L
deepstrom -e 50 -s 64 -v 10000 -a 1 -t 100 --svhn -m 64 -r -C
deepstrom -e 50 -s 64 -v 10000 -a 1 -t 100 --svhn -m 64 -r -L
deepstrom -e 50 -s 64 -v 10000 -a 1 -t 100 --svhn -m 128 -r -C
deepstrom -e 50 -s 64 -v 10000 -a 1 -t 100 --svhn -m 128 -r -L
deepstrom -e 50 -s 64 -v 10000 -a 1 -t 100 --svhn -m 256 -r -C
deepstrom -e 50 -s 64 -v 10000 -a 1 -t 100 --svhn -m 256 -r -L
deepstrom -e 50 -s 64 -v 10000 -a 1 -t 100 --svhn -m 512 -r -C
deepstrom -e 50 -s 64 -v 10000 -a 1 -t 100 --svhn -m 512 -r -L
deepstrom -e 50 -s 64 -v 10000 -a 1 -t 100 --svhn -m 1024 -r -C
deepstrom -e 50 -s 64 -v 10000 -a 1 -t 100 --svhn -m 1024 -r -L
deepstrom -e 50 -s 64 -v 10000 -a 1 -t 200 --svhn -m 16 -r -C
deepstrom -e 50 -s 64 -v 10000 -a 1 -t 200 --svhn -m 16 -r -L
deepstrom -e 50 -s 64 -v 10000 -a 1 -t 200 --svhn -m 64 -r -C
deepstrom -e 50 -s 64 -v 10000 -a 1 -t 200 --svhn -m 64 -r -L
deepstrom -e 50 -s 64 -v 10000 -a 1 -t 200 --svhn -m 128 -r -C
deepstrom -e 50 -s 64 -v 10000 -a 1 -t 200 --svhn -m 128 -r -L
deepstrom -e 50 -s 64 -v 10000 -a 1 -t 200 --svhn -m 256 -r -C
deepstrom -e 50 -s 64 -v 10000 -a 1 -t 200 --svhn -m 256 -r -L
deepstrom -e 50 -s 64 -v 10000 -a 1 -t 200 --svhn -m 512 -r -C
deepstrom -e 50 -s 64 -v 10000 -a 1 -t 200 --svhn -m 512 -r -L
deepstrom -e 50 -s 64 -v 10000 -a 1 -t 200 --svhn -m 1024 -r -C
deepstrom -e 50 -s 64 -v 10000 -a 1 -t 200 --svhn -m 1024 -r -L
deepstrom -e 50 -s 64 -v 10000 -a 1 -t 500 --svhn -m 16 -r -C
deepstrom -e 50 -s 64 -v 10000 -a 1 -t 500 --svhn -m 16 -r -L
deepstrom -e 50 -s 64 -v 10000 -a 1 -t 500 --svhn -m 64 -r -C
deepstrom -e 50 -s 64 -v 10000 -a 1 -t 500 --svhn -m 64 -r -L
deepstrom -e 50 -s 64 -v 10000 -a 1 -t 500 --svhn -m 128 -r -C
deepstrom -e 50 -s 64 -v 10000 -a 1 -t 500 --svhn -m 128 -r -L
deepstrom -e 50 -s 64 -v 10000 -a 1 -t 500 --svhn -m 256 -r -C
deepstrom -e 50 -s 64 -v 10000 -a 1 -t 500 --svhn -m 256 -r -L
deepstrom -e 50 -s 64 -v 10000 -a 1 -t 500 --svhn -m 512 -r -C
deepstrom -e 50 -s 64 -v 10000 -a 1 -t 500 --svhn -m 512 -r -L
deepstrom -e 50 -s 64 -v 10000 -a 1 -t 500 --svhn -m 1024 -r -C
deepstrom -e 50 -s 64 -v 10000 -a 1 -t 500 --svhn -m 1024 -r -L
deepstrom -e 50 -s 64 -v 10000 -a 1 -t 1000 --svhn -m 16 -r -C
deepstrom -e 50 -s 64 -v 10000 -a 1 -t 1000 --svhn -m 16 -r -L
deepstrom -e 50 -s 64 -v 10000 -a 1 -t 1000 --svhn -m 64 -r -C
deepstrom -e 50 -s 64 -v 10000 -a 1 -t 1000 --svhn -m 64 -r -L
deepstrom -e 50 -s 64 -v 10000 -a 1 -t 1000 --svhn -m 128 -r -C
deepstrom -e 50 -s 64 -v 10000 -a 1 -t 1000 --svhn -m 128 -r -L
deepstrom -e 50 -s 64 -v 10000 -a 1 -t 1000 --svhn -m 256 -r -C
deepstrom -e 50 -s 64 -v 10000 -a 1 -t 1000 --svhn -m 256 -r -L
deepstrom -e 50 -s 64 -v 10000 -a 1 -t 1000 --svhn -m 512 -r -C
deepstrom -e 50 -s 64 -v 10000 -a 1 -t 1000 --svhn -m 512 -r -L
deepstrom -e 50 -s 64 -v 10000 -a 1 -t 1000 --svhn -m 1024 -r -C
deepstrom -e 50 -s 64 -v 10000 -a 1 -t 1000 --svhn -m 1024 -r -L
deepstrom -e 50 -s 64 -v 10000 -a 1 -t 2000 --svhn -m 16 -r -C
deepstrom -e 50 -s 64 -v 10000 -a 1 -t 2000 --svhn -m 16 -r -L
deepstrom -e 50 -s 64 -v 10000 -a 1 -t 2000 --svhn -m 64 -r -C
deepstrom -e 50 -s 64 -v 10000 -a 1 -t 2000 --svhn -m 64 -r -L
deepstrom -e 50 -s 64 -v 10000 -a 1 -t 2000 --svhn -m 128 -r -C
deepstrom -e 50 -s 64 -v 10000 -a 1 -t 2000 --svhn -m 128 -r -L
deepstrom -e 50 -s 64 -v 10000 -a 1 -t 2000 --svhn -m 256 -r -C
deepstrom -e 50 -s 64 -v 10000 -a 1 -t 2000 --svhn -m 256 -r -L
deepstrom -e 50 -s 64 -v 10000 -a 1 -t 2000 --svhn -m 512 -r -C
deepstrom -e 50 -s 64 -v 10000 -a 1 -t 2000 --svhn -m 512 -r -L
deepstrom -e 50 -s 64 -v 10000 -a 1 -t 2000 --svhn -m 1024 -r -C
deepstrom -e 50 -s 64 -v 10000 -a 1 -t 2000 --svhn -m 1024 -r -L
deepstrom -e 50 -s 64 -v 10000 -a 2 -t 20 --svhn -m 16 -r -C
deepstrom -e 50 -s 64 -v 10000 -a 2 -t 20 --svhn -m 16 -r -L
deepstrom -e 50 -s 64 -v 10000 -a 2 -t 20 --svhn -m 64 -r -C
deepstrom -e 50 -s 64 -v 10000 -a 2 -t 20 --svhn -m 64 -r -L
deepstrom -e 50 -s 64 -v 10000 -a 2 -t 20 --svhn -m 128 -r -C
deepstrom -e 50 -s 64 -v 10000 -a 2 -t 20 --svhn -m 128 -r -L
deepstrom -e 50 -s 64 -v 10000 -a 2 -t 20 --svhn -m 256 -r -C
deepstrom -e 50 -s 64 -v 10000 -a 2 -t 20 --svhn -m 256 -r -L
deepstrom -e 50 -s 64 -v 10000 -a 2 -t 20 --svhn -m 512 -r -C
deepstrom -e 50 -s 64 -v 10000 -a 2 -t 20 --svhn -m 512 -r -L
deepstrom -e 50 -s 64 -v 10000 -a 2 -t 20 --svhn -m 1024 -r -C
deepstrom -e 50 -s 64 -v 10000 -a 2 -t 20 --svhn -m 1024 -r -L
deepstrom -e 50 -s 64 -v 10000 -a 2 -t 50 --svhn -m 16 -r -C
deepstrom -e 50 -s 64 -v 10000 -a 2 -t 50 --svhn -m 16 -r -L
deepstrom -e 50 -s 64 -v 10000 -a 2 -t 50 --svhn -m 64 -r -C
deepstrom -e 50 -s 64 -v 10000 -a 2 -t 50 --svhn -m 64 -r -L
deepstrom -e 50 -s 64 -v 10000 -a 2 -t 50 --svhn -m 128 -r -C
deepstrom -e 50 -s 64 -v 10000 -a 2 -t 50 --svhn -m 128 -r -L
deepstrom -e 50 -s 64 -v 10000 -a 2 -t 50 --svhn -m 256 -r -C
deepstrom -e 50 -s 64 -v 10000 -a 2 -t 50 --svhn -m 256 -r -L
deepstrom -e 50 -s 64 -v 10000 -a 2 -t 50 --svhn -m 512 -r -C
deepstrom -e 50 -s 64 -v 10000 -a 2 -t 50 --svhn -m 512 -r -L
deepstrom -e 50 -s 64 -v 10000 -a 2 -t 50 --svhn -m 1024 -r -C
deepstrom -e 50 -s 64 -v 10000 -a 2 -t 50 --svhn -m 1024 -r -L
deepstrom -e 50 -s 64 -v 10000 -a 2 -t 100 --svhn -m 16 -r -C
deepstrom -e 50 -s 64 -v 10000 -a 2 -t 100 --svhn -m 16 -r -L
deepstrom -e 50 -s 64 -v 10000 -a 2 -t 100 --svhn -m 64 -r -C
deepstrom -e 50 -s 64 -v 10000 -a 2 -t 100 --svhn -m 64 -r -L
deepstrom -e 50 -s 64 -v 10000 -a 2 -t 100 --svhn -m 128 -r -C
deepstrom -e 50 -s 64 -v 10000 -a 2 -t 100 --svhn -m 128 -r -L
deepstrom -e 50 -s 64 -v 10000 -a 2 -t 100 --svhn -m 256 -r -C
deepstrom -e 50 -s 64 -v 10000 -a 2 -t 100 --svhn -m 256 -r -L
deepstrom -e 50 -s 64 -v 10000 -a 2 -t 100 --svhn -m 512 -r -C
deepstrom -e 50 -s 64 -v 10000 -a 2 -t 100 --svhn -m 512 -r -L
deepstrom -e 50 -s 64 -v 10000 -a 2 -t 100 --svhn -m 1024 -r -C
deepstrom -e 50 -s 64 -v 10000 -a 2 -t 100 --svhn -m 1024 -r -L
deepstrom -e 50 -s 64 -v 10000 -a 2 -t 200 --svhn -m 16 -r -C
deepstrom -e 50 -s 64 -v 10000 -a 2 -t 200 --svhn -m 16 -r -L
deepstrom -e 50 -s 64 -v 10000 -a 2 -t 200 --svhn -m 64 -r -C
deepstrom -e 50 -s 64 -v 10000 -a 2 -t 200 --svhn -m 64 -r -L
deepstrom -e 50 -s 64 -v 10000 -a 2 -t 200 --svhn -m 128 -r -C
deepstrom -e 50 -s 64 -v 10000 -a 2 -t 200 --svhn -m 128 -r -L
deepstrom -e 50 -s 64 -v 10000 -a 2 -t 200 --svhn -m 256 -r -C
deepstrom -e 50 -s 64 -v 10000 -a 2 -t 200 --svhn -m 256 -r -L
deepstrom -e 50 -s 64 -v 10000 -a 2 -t 200 --svhn -m 512 -r -C
deepstrom -e 50 -s 64 -v 10000 -a 2 -t 200 --svhn -m 512 -r -L
deepstrom -e 50 -s 64 -v 10000 -a 2 -t 200 --svhn -m 1024 -r -C
deepstrom -e 50 -s 64 -v 10000 -a 2 -t 200 --svhn -m 1024 -r -L
deepstrom -e 50 -s 64 -v 10000 -a 2 -t 500 --svhn -m 16 -r -C
deepstrom -e 50 -s 64 -v 10000 -a 2 -t 500 --svhn -m 16 -r -L
deepstrom -e 50 -s 64 -v 10000 -a 2 -t 500 --svhn -m 64 -r -C
deepstrom -e 50 -s 64 -v 10000 -a 2 -t 500 --svhn -m 64 -r -L
deepstrom -e 50 -s 64 -v 10000 -a 2 -t 500 --svhn -m 128 -r -C
deepstrom -e 50 -s 64 -v 10000 -a 2 -t 500 --svhn -m 128 -r -L
deepstrom -e 50 -s 64 -v 10000 -a 2 -t 500 --svhn -m 256 -r -C
deepstrom -e 50 -s 64 -v 10000 -a 2 -t 500 --svhn -m 256 -r -L
deepstrom -e 50 -s 64 -v 10000 -a 2 -t 500 --svhn -m 512 -r -C
deepstrom -e 50 -s 64 -v 10000 -a 2 -t 500 --svhn -m 512 -r -L
deepstrom -e 50 -s 64 -v 10000 -a 2 -t 500 --svhn -m 1024 -r -C
deepstrom -e 50 -s 64 -v 10000 -a 2 -t 500 --svhn -m 1024 -r -L
deepstrom -e 50 -s 64 -v 10000 -a 2 -t 1000 --svhn -m 16 -r -C
deepstrom -e 50 -s 64 -v 10000 -a 2 -t 1000 --svhn -m 16 -r -L
deepstrom -e 50 -s 64 -v 10000 -a 2 -t 1000 --svhn -m 64 -r -C
deepstrom -e 50 -s 64 -v 10000 -a 2 -t 1000 --svhn -m 64 -r -L
deepstrom -e 50 -s 64 -v 10000 -a 2 -t 1000 --svhn -m 128 -r -C
deepstrom -e 50 -s 64 -v 10000 -a 2 -t 1000 --svhn -m 128 -r -L
deepstrom -e 50 -s 64 -v 10000 -a 2 -t 1000 --svhn -m 256 -r -C
deepstrom -e 50 -s 64 -v 10000 -a 2 -t 1000 --svhn -m 256 -r -L
deepstrom -e 50 -s 64 -v 10000 -a 2 -t 1000 --svhn -m 512 -r -C
deepstrom -e 50 -s 64 -v 10000 -a 2 -t 1000 --svhn -m 512 -r -L
deepstrom -e 50 -s 64 -v 10000 -a 2 -t 1000 --svhn -m 1024 -r -C
deepstrom -e 50 -s 64 -v 10000 -a 2 -t 1000 --svhn -m 1024 -r -L
deepstrom -e 50 -s 64 -v 10000 -a 2 -t 2000 --svhn -m 16 -r -C
deepstrom -e 50 -s 64 -v 10000 -a 2 -t 2000 --svhn -m 16 -r -L
deepstrom -e 50 -s 64 -v 10000 -a 2 -t 2000 --svhn -m 64 -r -C
deepstrom -e 50 -s 64 -v 10000 -a 2 -t 2000 --svhn -m 64 -r -L
deepstrom -e 50 -s 64 -v 10000 -a 2 -t 2000 --svhn -m 128 -r -C
deepstrom -e 50 -s 64 -v 10000 -a 2 -t 2000 --svhn -m 128 -r -L
deepstrom -e 50 -s 64 -v 10000 -a 2 -t 2000 --svhn -m 256 -r -C
deepstrom -e 50 -s 64 -v 10000 -a 2 -t 2000 --svhn -m 256 -r -L
deepstrom -e 50 -s 64 -v 10000 -a 2 -t 2000 --svhn -m 512 -r -C
deepstrom -e 50 -s 64 -v 10000 -a 2 -t 2000 --svhn -m 512 -r -L
deepstrom -e 50 -s 64 -v 10000 -a 2 -t 2000 --svhn -m 1024 -r -C
deepstrom -e 50 -s 64 -v 10000 -a 2 -t 2000 --svhn -m 1024 -r -L
deepstrom -e 50 -s 64 -v 10000 -a 0 -t 20 --svhn -m 16 -g 0.0025145440260884045 -R
deepstrom -e 50 -s 64 -v 10000 -a 0 -t 20 --svhn -m 64 -g 0.0025145440260884045 -R
deepstrom -e 50 -s 64 -v 10000 -a 0 -t 20 --svhn -m 128 -g 0.0025145440260884045 -R
deepstrom -e 50 -s 64 -v 10000 -a 0 -t 20 --svhn -m 256 -g 0.0025145440260884045 -R
deepstrom -e 50 -s 64 -v 10000 -a 0 -t 20 --svhn -m 512 -g 0.0025145440260884045 -R
deepstrom -e 50 -s 64 -v 10000 -a 0 -t 20 --svhn -m 1024 -g 0.0025145440260884045 -R
deepstrom -e 50 -s 64 -v 10000 -a 0 -t 50 --svhn -m 16 -g 0.0025145440260884045 -R
deepstrom -e 50 -s 64 -v 10000 -a 0 -t 50 --svhn -m 64 -g 0.0025145440260884045 -R
deepstrom -e 50 -s 64 -v 10000 -a 0 -t 50 --svhn -m 128 -g 0.0025145440260884045 -R
deepstrom -e 50 -s 64 -v 10000 -a 0 -t 50 --svhn -m 256 -g 0.0025145440260884045 -R
deepstrom -e 50 -s 64 -v 10000 -a 0 -t 50 --svhn -m 512 -g 0.0025145440260884045 -R
deepstrom -e 50 -s 64 -v 10000 -a 0 -t 50 --svhn -m 1024 -g 0.0025145440260884045 -R
deepstrom -e 50 -s 64 -v 10000 -a 0 -t 100 --svhn -m 16 -g 0.0025145440260884045 -R
deepstrom -e 50 -s 64 -v 10000 -a 0 -t 100 --svhn -m 64 -g 0.0025145440260884045 -R
deepstrom -e 50 -s 64 -v 10000 -a 0 -t 100 --svhn -m 128 -g 0.0025145440260884045 -R
deepstrom -e 50 -s 64 -v 10000 -a 0 -t 100 --svhn -m 256 -g 0.0025145440260884045 -R
deepstrom -e 50 -s 64 -v 10000 -a 0 -t 100 --svhn -m 512 -g 0.0025145440260884045 -R
deepstrom -e 50 -s 64 -v 10000 -a 0 -t 100 --svhn -m 1024 -g 0.0025145440260884045 -R
deepstrom -e 50 -s 64 -v 10000 -a 0 -t 200 --svhn -m 16 -g 0.0025145440260884045 -R
deepstrom -e 50 -s 64 -v 10000 -a 0 -t 200 --svhn -m 64 -g 0.0025145440260884045 -R
deepstrom -e 50 -s 64 -v 10000 -a 0 -t 200 --svhn -m 128 -g 0.0025145440260884045 -R
deepstrom -e 50 -s 64 -v 10000 -a 0 -t 200 --svhn -m 256 -g 0.0025145440260884045 -R
deepstrom -e 50 -s 64 -v 10000 -a 0 -t 200 --svhn -m 512 -g 0.0025145440260884045 -R
deepstrom -e 50 -s 64 -v 10000 -a 0 -t 200 --svhn -m 1024 -g 0.0025145440260884045 -R
deepstrom -e 50 -s 64 -v 10000 -a 0 -t 500 --svhn -m 16 -g 0.0025145440260884045 -R
deepstrom -e 50 -s 64 -v 10000 -a 0 -t 500 --svhn -m 64 -g 0.0025145440260884045 -R
deepstrom -e 50 -s 64 -v 10000 -a 0 -t 500 --svhn -m 128 -g 0.0025145440260884045 -R
deepstrom -e 50 -s 64 -v 10000 -a 0 -t 500 --svhn -m 256 -g 0.0025145440260884045 -R
deepstrom -e 50 -s 64 -v 10000 -a 0 -t 500 --svhn -m 512 -g 0.0025145440260884045 -R
deepstrom -e 50 -s 64 -v 10000 -a 0 -t 500 --svhn -m 1024 -g 0.0025145440260884045 -R
deepstrom -e 50 -s 64 -v 10000 -a 0 -t 1000 --svhn -m 16 -g 0.0025145440260884045 -R
deepstrom -e 50 -s 64 -v 10000 -a 0 -t 1000 --svhn -m 64 -g 0.0025145440260884045 -R
deepstrom -e 50 -s 64 -v 10000 -a 0 -t 1000 --svhn -m 128 -g 0.0025145440260884045 -R
deepstrom -e 50 -s 64 -v 10000 -a 0 -t 1000 --svhn -m 256 -g 0.0025145440260884045 -R
deepstrom -e 50 -s 64 -v 10000 -a 0 -t 1000 --svhn -m 512 -g 0.0025145440260884045 -R
deepstrom -e 50 -s 64 -v 10000 -a 0 -t 1000 --svhn -m 1024 -g 0.0025145440260884045 -R
deepstrom -e 50 -s 64 -v 10000 -a 0 -t 2000 --svhn -m 16 -g 0.0025145440260884045 -R
deepstrom -e 50 -s 64 -v 10000 -a 0 -t 2000 --svhn -m 64 -g 0.0025145440260884045 -R
deepstrom -e 50 -s 64 -v 10000 -a 0 -t 2000 --svhn -m 128 -g 0.0025145440260884045 -R
deepstrom -e 50 -s 64 -v 10000 -a 0 -t 2000 --svhn -m 256 -g 0.0025145440260884045 -R
deepstrom -e 50 -s 64 -v 10000 -a 0 -t 2000 --svhn -m 512 -g 0.0025145440260884045 -R
deepstrom -e 50 -s 64 -v 10000 -a 0 -t 2000 --svhn -m 1024 -g 0.0025145440260884045 -R
deepstrom -e 50 -s 64 -v 10000 -a 1 -t 20 --svhn -m 16 -g 0.0025145440260884045 -R
deepstrom -e 50 -s 64 -v 10000 -a 1 -t 20 --svhn -m 64 -g 0.0025145440260884045 -R
deepstrom -e 50 -s 64 -v 10000 -a 1 -t 20 --svhn -m 128 -g 0.0025145440260884045 -R
deepstrom -e 50 -s 64 -v 10000 -a 1 -t 20 --svhn -m 256 -g 0.0025145440260884045 -R
deepstrom -e 50 -s 64 -v 10000 -a 1 -t 20 --svhn -m 512 -g 0.0025145440260884045 -R
deepstrom -e 50 -s 64 -v 10000 -a 1 -t 20 --svhn -m 1024 -g 0.0025145440260884045 -R
deepstrom -e 50 -s 64 -v 10000 -a 1 -t 50 --svhn -m 16 -g 0.0025145440260884045 -R
deepstrom -e 50 -s 64 -v 10000 -a 1 -t 50 --svhn -m 64 -g 0.0025145440260884045 -R
deepstrom -e 50 -s 64 -v 10000 -a 1 -t 50 --svhn -m 128 -g 0.0025145440260884045 -R
deepstrom -e 50 -s 64 -v 10000 -a 1 -t 50 --svhn -m 256 -g 0.0025145440260884045 -R
deepstrom -e 50 -s 64 -v 10000 -a 1 -t 50 --svhn -m 512 -g 0.0025145440260884045 -R
deepstrom -e 50 -s 64 -v 10000 -a 1 -t 50 --svhn -m 1024 -g 0.0025145440260884045 -R
deepstrom -e 50 -s 64 -v 10000 -a 1 -t 100 --svhn -m 16 -g 0.0025145440260884045 -R
deepstrom -e 50 -s 64 -v 10000 -a 1 -t 100 --svhn -m 64 -g 0.0025145440260884045 -R
deepstrom -e 50 -s 64 -v 10000 -a 1 -t 100 --svhn -m 128 -g 0.0025145440260884045 -R
deepstrom -e 50 -s 64 -v 10000 -a 1 -t 100 --svhn -m 256 -g 0.0025145440260884045 -R
deepstrom -e 50 -s 64 -v 10000 -a 1 -t 100 --svhn -m 512 -g 0.0025145440260884045 -R
deepstrom -e 50 -s 64 -v 10000 -a 1 -t 100 --svhn -m 1024 -g 0.0025145440260884045 -R
deepstrom -e 50 -s 64 -v 10000 -a 1 -t 200 --svhn -m 16 -g 0.0025145440260884045 -R
deepstrom -e 50 -s 64 -v 10000 -a 1 -t 200 --svhn -m 64 -g 0.0025145440260884045 -R
deepstrom -e 50 -s 64 -v 10000 -a 1 -t 200 --svhn -m 128 -g 0.0025145440260884045 -R
deepstrom -e 50 -s 64 -v 10000 -a 1 -t 200 --svhn -m 256 -g 0.0025145440260884045 -R
deepstrom -e 50 -s 64 -v 10000 -a 1 -t 200 --svhn -m 512 -g 0.0025145440260884045 -R
deepstrom -e 50 -s 64 -v 10000 -a 1 -t 200 --svhn -m 1024 -g 0.0025145440260884045 -R
deepstrom -e 50 -s 64 -v 10000 -a 1 -t 500 --svhn -m 16 -g 0.0025145440260884045 -R
deepstrom -e 50 -s 64 -v 10000 -a 1 -t 500 --svhn -m 64 -g 0.0025145440260884045 -R
deepstrom -e 50 -s 64 -v 10000 -a 1 -t 500 --svhn -m 128 -g 0.0025145440260884045 -R
deepstrom -e 50 -s 64 -v 10000 -a 1 -t 500 --svhn -m 256 -g 0.0025145440260884045 -R
deepstrom -e 50 -s 64 -v 10000 -a 1 -t 500 --svhn -m 512 -g 0.0025145440260884045 -R
deepstrom -e 50 -s 64 -v 10000 -a 1 -t 500 --svhn -m 1024 -g 0.0025145440260884045 -R
deepstrom -e 50 -s 64 -v 10000 -a 1 -t 1000 --svhn -m 16 -g 0.0025145440260884045 -R
deepstrom -e 50 -s 64 -v 10000 -a 1 -t 1000 --svhn -m 64 -g 0.0025145440260884045 -R
deepstrom -e 50 -s 64 -v 10000 -a 1 -t 1000 --svhn -m 128 -g 0.0025145440260884045 -R
deepstrom -e 50 -s 64 -v 10000 -a 1 -t 1000 --svhn -m 256 -g 0.0025145440260884045 -R
deepstrom -e 50 -s 64 -v 10000 -a 1 -t 1000 --svhn -m 512 -g 0.0025145440260884045 -R
deepstrom -e 50 -s 64 -v 10000 -a 1 -t 1000 --svhn -m 1024 -g 0.0025145440260884045 -R
deepstrom -e 50 -s 64 -v 10000 -a 1 -t 2000 --svhn -m 16 -g 0.0025145440260884045 -R
deepstrom -e 50 -s 64 -v 10000 -a 1 -t 2000 --svhn -m 64 -g 0.0025145440260884045 -R
deepstrom -e 50 -s 64 -v 10000 -a 1 -t 2000 --svhn -m 128 -g 0.0025145440260884045 -R
deepstrom -e 50 -s 64 -v 10000 -a 1 -t 2000 --svhn -m 256 -g 0.0025145440260884045 -R
deepstrom -e 50 -s 64 -v 10000 -a 1 -t 2000 --svhn -m 512 -g 0.0025145440260884045 -R
deepstrom -e 50 -s 64 -v 10000 -a 1 -t 2000 --svhn -m 1024 -g 0.0025145440260884045 -R
deepstrom -e 50 -s 64 -v 10000 -a 2 -t 20 --svhn -m 16 -g 0.0025145440260884045 -R
deepstrom -e 50 -s 64 -v 10000 -a 2 -t 20 --svhn -m 64 -g 0.0025145440260884045 -R
deepstrom -e 50 -s 64 -v 10000 -a 2 -t 20 --svhn -m 128 -g 0.0025145440260884045 -R
deepstrom -e 50 -s 64 -v 10000 -a 2 -t 20 --svhn -m 256 -g 0.0025145440260884045 -R
deepstrom -e 50 -s 64 -v 10000 -a 2 -t 20 --svhn -m 512 -g 0.0025145440260884045 -R
deepstrom -e 50 -s 64 -v 10000 -a 2 -t 20 --svhn -m 1024 -g 0.0025145440260884045 -R
deepstrom -e 50 -s 64 -v 10000 -a 2 -t 50 --svhn -m 16 -g 0.0025145440260884045 -R
deepstrom -e 50 -s 64 -v 10000 -a 2 -t 50 --svhn -m 64 -g 0.0025145440260884045 -R
deepstrom -e 50 -s 64 -v 10000 -a 2 -t 50 --svhn -m 128 -g 0.0025145440260884045 -R
deepstrom -e 50 -s 64 -v 10000 -a 2 -t 50 --svhn -m 256 -g 0.0025145440260884045 -R
deepstrom -e 50 -s 64 -v 10000 -a 2 -t 50 --svhn -m 512 -g 0.0025145440260884045 -R
deepstrom -e 50 -s 64 -v 10000 -a 2 -t 50 --svhn -m 1024 -g 0.0025145440260884045 -R
deepstrom -e 50 -s 64 -v 10000 -a 2 -t 100 --svhn -m 16 -g 0.0025145440260884045 -R
deepstrom -e 50 -s 64 -v 10000 -a 2 -t 100 --svhn -m 64 -g 0.0025145440260884045 -R
deepstrom -e 50 -s 64 -v 10000 -a 2 -t 100 --svhn -m 128 -g 0.0025145440260884045 -R
deepstrom -e 50 -s 64 -v 10000 -a 2 -t 100 --svhn -m 256 -g 0.0025145440260884045 -R
deepstrom -e 50 -s 64 -v 10000 -a 2 -t 100 --svhn -m 512 -g 0.0025145440260884045 -R
deepstrom -e 50 -s 64 -v 10000 -a 2 -t 100 --svhn -m 1024 -g 0.0025145440260884045 -R
deepstrom -e 50 -s 64 -v 10000 -a 2 -t 200 --svhn -m 16 -g 0.0025145440260884045 -R
deepstrom -e 50 -s 64 -v 10000 -a 2 -t 200 --svhn -m 64 -g 0.0025145440260884045 -R
deepstrom -e 50 -s 64 -v 10000 -a 2 -t 200 --svhn -m 128 -g 0.0025145440260884045 -R
deepstrom -e 50 -s 64 -v 10000 -a 2 -t 200 --svhn -m 256 -g 0.0025145440260884045 -R
deepstrom -e 50 -s 64 -v 10000 -a 2 -t 200 --svhn -m 512 -g 0.0025145440260884045 -R
deepstrom -e 50 -s 64 -v 10000 -a 2 -t 200 --svhn -m 1024 -g 0.0025145440260884045 -R
deepstrom -e 50 -s 64 -v 10000 -a 2 -t 500 --svhn -m 16 -g 0.0025145440260884045 -R
deepstrom -e 50 -s 64 -v 10000 -a 2 -t 500 --svhn -m 64 -g 0.0025145440260884045 -R
deepstrom -e 50 -s 64 -v 10000 -a 2 -t 500 --svhn -m 128 -g 0.0025145440260884045 -R
deepstrom -e 50 -s 64 -v 10000 -a 2 -t 500 --svhn -m 256 -g 0.0025145440260884045 -R
deepstrom -e 50 -s 64 -v 10000 -a 2 -t 500 --svhn -m 512 -g 0.0025145440260884045 -R
deepstrom -e 50 -s 64 -v 10000 -a 2 -t 500 --svhn -m 1024 -g 0.0025145440260884045 -R
deepstrom -e 50 -s 64 -v 10000 -a 2 -t 1000 --svhn -m 16 -g 0.0025145440260884045 -R
deepstrom -e 50 -s 64 -v 10000 -a 2 -t 1000 --svhn -m 64 -g 0.0025145440260884045 -R
deepstrom -e 50 -s 64 -v 10000 -a 2 -t 1000 --svhn -m 128 -g 0.0025145440260884045 -R
deepstrom -e 50 -s 64 -v 10000 -a 2 -t 1000 --svhn -m 256 -g 0.0025145440260884045 -R
deepstrom -e 50 -s 64 -v 10000 -a 2 -t 1000 --svhn -m 512 -g 0.0025145440260884045 -R
deepstrom -e 50 -s 64 -v 10000 -a 2 -t 1000 --svhn -m 1024 -g 0.0025145440260884045 -R
deepstrom -e 50 -s 64 -v 10000 -a 2 -t 2000 --svhn -m 16 -g 0.0025145440260884045 -R
deepstrom -e 50 -s 64 -v 10000 -a 2 -t 2000 --svhn -m 64 -g 0.0025145440260884045 -R
deepstrom -e 50 -s 64 -v 10000 -a 2 -t 2000 --svhn -m 128 -g 0.0025145440260884045 -R
deepstrom -e 50 -s 64 -v 10000 -a 2 -t 2000 --svhn -m 256 -g 0.0025145440260884045 -R
deepstrom -e 50 -s 64 -v 10000 -a 2 -t 2000 --svhn -m 512 -g 0.0025145440260884045 -R
deepstrom -e 50 -s 64 -v 10000 -a 2 -t 2000 --svhn -m 1024 -g 0.0025145440260884045 -R
deepstrom -e 50 -s 64 -v 10000 -a 0 -t 20 --svhn -m 16 -C
deepstrom -e 50 -s 64 -v 10000 -a 0 -t 20 --svhn -m 16 -L
deepstrom -e 50 -s 64 -v 10000 -a 0 -t 20 --svhn -m 64 -C
deepstrom -e 50 -s 64 -v 10000 -a 0 -t 20 --svhn -m 64 -L
deepstrom -e 50 -s 64 -v 10000 -a 0 -t 20 --svhn -m 128 -C
deepstrom -e 50 -s 64 -v 10000 -a 0 -t 20 --svhn -m 128 -L
deepstrom -e 50 -s 64 -v 10000 -a 0 -t 20 --svhn -m 256 -C
deepstrom -e 50 -s 64 -v 10000 -a 0 -t 20 --svhn -m 256 -L
deepstrom -e 50 -s 64 -v 10000 -a 0 -t 20 --svhn -m 512 -C
deepstrom -e 50 -s 64 -v 10000 -a 0 -t 20 --svhn -m 512 -L
deepstrom -e 50 -s 64 -v 10000 -a 0 -t 20 --svhn -m 1024 -C
deepstrom -e 50 -s 64 -v 10000 -a 0 -t 20 --svhn -m 1024 -L
deepstrom -e 50 -s 64 -v 10000 -a 0 -t 50 --svhn -m 16 -C
deepstrom -e 50 -s 64 -v 10000 -a 0 -t 50 --svhn -m 16 -L
deepstrom -e 50 -s 64 -v 10000 -a 0 -t 50 --svhn -m 64 -C
deepstrom -e 50 -s 64 -v 10000 -a 0 -t 50 --svhn -m 64 -L
deepstrom -e 50 -s 64 -v 10000 -a 0 -t 50 --svhn -m 128 -C
deepstrom -e 50 -s 64 -v 10000 -a 0 -t 50 --svhn -m 128 -L
deepstrom -e 50 -s 64 -v 10000 -a 0 -t 50 --svhn -m 256 -C
deepstrom -e 50 -s 64 -v 10000 -a 0 -t 50 --svhn -m 256 -L
deepstrom -e 50 -s 64 -v 10000 -a 0 -t 50 --svhn -m 512 -C
deepstrom -e 50 -s 64 -v 10000 -a 0 -t 50 --svhn -m 512 -L
deepstrom -e 50 -s 64 -v 10000 -a 0 -t 50 --svhn -m 1024 -C
deepstrom -e 50 -s 64 -v 10000 -a 0 -t 50 --svhn -m 1024 -L
deepstrom -e 50 -s 64 -v 10000 -a 0 -t 100 --svhn -m 16 -C
deepstrom -e 50 -s 64 -v 10000 -a 0 -t 100 --svhn -m 16 -L
deepstrom -e 50 -s 64 -v 10000 -a 0 -t 100 --svhn -m 64 -C
deepstrom -e 50 -s 64 -v 10000 -a 0 -t 100 --svhn -m 64 -L
deepstrom -e 50 -s 64 -v 10000 -a 0 -t 100 --svhn -m 128 -C
deepstrom -e 50 -s 64 -v 10000 -a 0 -t 100 --svhn -m 128 -L
deepstrom -e 50 -s 64 -v 10000 -a 0 -t 100 --svhn -m 256 -C
deepstrom -e 50 -s 64 -v 10000 -a 0 -t 100 --svhn -m 256 -L
deepstrom -e 50 -s 64 -v 10000 -a 0 -t 100 --svhn -m 512 -C
deepstrom -e 50 -s 64 -v 10000 -a 0 -t 100 --svhn -m 512 -L
deepstrom -e 50 -s 64 -v 10000 -a 0 -t 100 --svhn -m 1024 -C
deepstrom -e 50 -s 64 -v 10000 -a 0 -t 100 --svhn -m 1024 -L
deepstrom -e 50 -s 64 -v 10000 -a 0 -t 200 --svhn -m 16 -C
deepstrom -e 50 -s 64 -v 10000 -a 0 -t 200 --svhn -m 16 -L
deepstrom -e 50 -s 64 -v 10000 -a 0 -t 200 --svhn -m 64 -C
deepstrom -e 50 -s 64 -v 10000 -a 0 -t 200 --svhn -m 64 -L
deepstrom -e 50 -s 64 -v 10000 -a 0 -t 200 --svhn -m 128 -C
deepstrom -e 50 -s 64 -v 10000 -a 0 -t 200 --svhn -m 128 -L
deepstrom -e 50 -s 64 -v 10000 -a 0 -t 200 --svhn -m 256 -C
deepstrom -e 50 -s 64 -v 10000 -a 0 -t 200 --svhn -m 256 -L
deepstrom -e 50 -s 64 -v 10000 -a 0 -t 200 --svhn -m 512 -C
deepstrom -e 50 -s 64 -v 10000 -a 0 -t 200 --svhn -m 512 -L
deepstrom -e 50 -s 64 -v 10000 -a 0 -t 200 --svhn -m 1024 -C
deepstrom -e 50 -s 64 -v 10000 -a 0 -t 200 --svhn -m 1024 -L
deepstrom -e 50 -s 64 -v 10000 -a 0 -t 500 --svhn -m 16 -C
deepstrom -e 50 -s 64 -v 10000 -a 0 -t 500 --svhn -m 16 -L
deepstrom -e 50 -s 64 -v 10000 -a 0 -t 500 --svhn -m 64 -C
deepstrom -e 50 -s 64 -v 10000 -a 0 -t 500 --svhn -m 64 -L
deepstrom -e 50 -s 64 -v 10000 -a 0 -t 500 --svhn -m 128 -C
deepstrom -e 50 -s 64 -v 10000 -a 0 -t 500 --svhn -m 128 -L
deepstrom -e 50 -s 64 -v 10000 -a 0 -t 500 --svhn -m 256 -C
deepstrom -e 50 -s 64 -v 10000 -a 0 -t 500 --svhn -m 256 -L
deepstrom -e 50 -s 64 -v 10000 -a 0 -t 500 --svhn -m 512 -C
deepstrom -e 50 -s 64 -v 10000 -a 0 -t 500 --svhn -m 512 -L
deepstrom -e 50 -s 64 -v 10000 -a 0 -t 500 --svhn -m 1024 -C
deepstrom -e 50 -s 64 -v 10000 -a 0 -t 500 --svhn -m 1024 -L
deepstrom -e 50 -s 64 -v 10000 -a 0 -t 1000 --svhn -m 16 -C
deepstrom -e 50 -s 64 -v 10000 -a 0 -t 1000 --svhn -m 16 -L
deepstrom -e 50 -s 64 -v 10000 -a 0 -t 1000 --svhn -m 64 -C
deepstrom -e 50 -s 64 -v 10000 -a 0 -t 1000 --svhn -m 64 -L
deepstrom -e 50 -s 64 -v 10000 -a 0 -t 1000 --svhn -m 128 -C
deepstrom -e 50 -s 64 -v 10000 -a 0 -t 1000 --svhn -m 128 -L
deepstrom -e 50 -s 64 -v 10000 -a 0 -t 1000 --svhn -m 256 -C
deepstrom -e 50 -s 64 -v 10000 -a 0 -t 1000 --svhn -m 256 -L
deepstrom -e 50 -s 64 -v 10000 -a 0 -t 1000 --svhn -m 512 -C
deepstrom -e 50 -s 64 -v 10000 -a 0 -t 1000 --svhn -m 512 -L
deepstrom -e 50 -s 64 -v 10000 -a 0 -t 1000 --svhn -m 1024 -C
deepstrom -e 50 -s 64 -v 10000 -a 0 -t 1000 --svhn -m 1024 -L
deepstrom -e 50 -s 64 -v 10000 -a 0 -t 2000 --svhn -m 16 -C
deepstrom -e 50 -s 64 -v 10000 -a 0 -t 2000 --svhn -m 16 -L
deepstrom -e 50 -s 64 -v 10000 -a 0 -t 2000 --svhn -m 64 -C
deepstrom -e 50 -s 64 -v 10000 -a 0 -t 2000 --svhn -m 64 -L
deepstrom -e 50 -s 64 -v 10000 -a 0 -t 2000 --svhn -m 128 -C
deepstrom -e 50 -s 64 -v 10000 -a 0 -t 2000 --svhn -m 128 -L
deepstrom -e 50 -s 64 -v 10000 -a 0 -t 2000 --svhn -m 256 -C
deepstrom -e 50 -s 64 -v 10000 -a 0 -t 2000 --svhn -m 256 -L
deepstrom -e 50 -s 64 -v 10000 -a 0 -t 2000 --svhn -m 512 -C
deepstrom -e 50 -s 64 -v 10000 -a 0 -t 2000 --svhn -m 512 -L
deepstrom -e 50 -s 64 -v 10000 -a 0 -t 2000 --svhn -m 1024 -C
deepstrom -e 50 -s 64 -v 10000 -a 0 -t 2000 --svhn -m 1024 -L
deepstrom -e 50 -s 64 -v 10000 -a 1 -t 20 --svhn -m 16 -C
deepstrom -e 50 -s 64 -v 10000 -a 1 -t 20 --svhn -m 16 -L
deepstrom -e 50 -s 64 -v 10000 -a 1 -t 20 --svhn -m 64 -C
deepstrom -e 50 -s 64 -v 10000 -a 1 -t 20 --svhn -m 64 -L
deepstrom -e 50 -s 64 -v 10000 -a 1 -t 20 --svhn -m 128 -C
deepstrom -e 50 -s 64 -v 10000 -a 1 -t 20 --svhn -m 128 -L
deepstrom -e 50 -s 64 -v 10000 -a 1 -t 20 --svhn -m 256 -C
deepstrom -e 50 -s 64 -v 10000 -a 1 -t 20 --svhn -m 256 -L
deepstrom -e 50 -s 64 -v 10000 -a 1 -t 20 --svhn -m 512 -C
deepstrom -e 50 -s 64 -v 10000 -a 1 -t 20 --svhn -m 512 -L
deepstrom -e 50 -s 64 -v 10000 -a 1 -t 20 --svhn -m 1024 -C
deepstrom -e 50 -s 64 -v 10000 -a 1 -t 20 --svhn -m 1024 -L
deepstrom -e 50 -s 64 -v 10000 -a 1 -t 50 --svhn -m 16 -C
deepstrom -e 50 -s 64 -v 10000 -a 1 -t 50 --svhn -m 16 -L
deepstrom -e 50 -s 64 -v 10000 -a 1 -t 50 --svhn -m 64 -C
deepstrom -e 50 -s 64 -v 10000 -a 1 -t 50 --svhn -m 64 -L
deepstrom -e 50 -s 64 -v 10000 -a 1 -t 50 --svhn -m 128 -C
deepstrom -e 50 -s 64 -v 10000 -a 1 -t 50 --svhn -m 128 -L
deepstrom -e 50 -s 64 -v 10000 -a 1 -t 50 --svhn -m 256 -C
deepstrom -e 50 -s 64 -v 10000 -a 1 -t 50 --svhn -m 256 -L
deepstrom -e 50 -s 64 -v 10000 -a 1 -t 50 --svhn -m 512 -C
deepstrom -e 50 -s 64 -v 10000 -a 1 -t 50 --svhn -m 512 -L
deepstrom -e 50 -s 64 -v 10000 -a 1 -t 50 --svhn -m 1024 -C
deepstrom -e 50 -s 64 -v 10000 -a 1 -t 50 --svhn -m 1024 -L
deepstrom -e 50 -s 64 -v 10000 -a 1 -t 100 --svhn -m 16 -C
deepstrom -e 50 -s 64 -v 10000 -a 1 -t 100 --svhn -m 16 -L
deepstrom -e 50 -s 64 -v 10000 -a 1 -t 100 --svhn -m 64 -C
deepstrom -e 50 -s 64 -v 10000 -a 1 -t 100 --svhn -m 64 -L
deepstrom -e 50 -s 64 -v 10000 -a 1 -t 100 --svhn -m 128 -C
deepstrom -e 50 -s 64 -v 10000 -a 1 -t 100 --svhn -m 128 -L
deepstrom -e 50 -s 64 -v 10000 -a 1 -t 100 --svhn -m 256 -C
deepstrom -e 50 -s 64 -v 10000 -a 1 -t 100 --svhn -m 256 -L
deepstrom -e 50 -s 64 -v 10000 -a 1 -t 100 --svhn -m 512 -C
deepstrom -e 50 -s 64 -v 10000 -a 1 -t 100 --svhn -m 512 -L
deepstrom -e 50 -s 64 -v 10000 -a 1 -t 100 --svhn -m 1024 -C
deepstrom -e 50 -s 64 -v 10000 -a 1 -t 100 --svhn -m 1024 -L
deepstrom -e 50 -s 64 -v 10000 -a 1 -t 200 --svhn -m 16 -C
deepstrom -e 50 -s 64 -v 10000 -a 1 -t 200 --svhn -m 16 -L
deepstrom -e 50 -s 64 -v 10000 -a 1 -t 200 --svhn -m 64 -C
deepstrom -e 50 -s 64 -v 10000 -a 1 -t 200 --svhn -m 64 -L
deepstrom -e 50 -s 64 -v 10000 -a 1 -t 200 --svhn -m 128 -C
deepstrom -e 50 -s 64 -v 10000 -a 1 -t 200 --svhn -m 128 -L
deepstrom -e 50 -s 64 -v 10000 -a 1 -t 200 --svhn -m 256 -C
deepstrom -e 50 -s 64 -v 10000 -a 1 -t 200 --svhn -m 256 -L
deepstrom -e 50 -s 64 -v 10000 -a 1 -t 200 --svhn -m 512 -C
deepstrom -e 50 -s 64 -v 10000 -a 1 -t 200 --svhn -m 512 -L
deepstrom -e 50 -s 64 -v 10000 -a 1 -t 200 --svhn -m 1024 -C
deepstrom -e 50 -s 64 -v 10000 -a 1 -t 200 --svhn -m 1024 -L
deepstrom -e 50 -s 64 -v 10000 -a 1 -t 500 --svhn -m 16 -C
deepstrom -e 50 -s 64 -v 10000 -a 1 -t 500 --svhn -m 16 -L
deepstrom -e 50 -s 64 -v 10000 -a 1 -t 500 --svhn -m 64 -C
deepstrom -e 50 -s 64 -v 10000 -a 1 -t 500 --svhn -m 64 -L
deepstrom -e 50 -s 64 -v 10000 -a 1 -t 500 --svhn -m 128 -C
deepstrom -e 50 -s 64 -v 10000 -a 1 -t 500 --svhn -m 128 -L
deepstrom -e 50 -s 64 -v 10000 -a 1 -t 500 --svhn -m 256 -C
deepstrom -e 50 -s 64 -v 10000 -a 1 -t 500 --svhn -m 256 -L
deepstrom -e 50 -s 64 -v 10000 -a 1 -t 500 --svhn -m 512 -C
deepstrom -e 50 -s 64 -v 10000 -a 1 -t 500 --svhn -m 512 -L
deepstrom -e 50 -s 64 -v 10000 -a 1 -t 500 --svhn -m 1024 -C
deepstrom -e 50 -s 64 -v 10000 -a 1 -t 500 --svhn -m 1024 -L
deepstrom -e 50 -s 64 -v 10000 -a 1 -t 1000 --svhn -m 16 -C
deepstrom -e 50 -s 64 -v 10000 -a 1 -t 1000 --svhn -m 16 -L
deepstrom -e 50 -s 64 -v 10000 -a 1 -t 1000 --svhn -m 64 -C
deepstrom -e 50 -s 64 -v 10000 -a 1 -t 1000 --svhn -m 64 -L
deepstrom -e 50 -s 64 -v 10000 -a 1 -t 1000 --svhn -m 128 -C
deepstrom -e 50 -s 64 -v 10000 -a 1 -t 1000 --svhn -m 128 -L
deepstrom -e 50 -s 64 -v 10000 -a 1 -t 1000 --svhn -m 256 -C
deepstrom -e 50 -s 64 -v 10000 -a 1 -t 1000 --svhn -m 256 -L
deepstrom -e 50 -s 64 -v 10000 -a 1 -t 1000 --svhn -m 512 -C
deepstrom -e 50 -s 64 -v 10000 -a 1 -t 1000 --svhn -m 512 -L
deepstrom -e 50 -s 64 -v 10000 -a 1 -t 1000 --svhn -m 1024 -C
deepstrom -e 50 -s 64 -v 10000 -a 1 -t 1000 --svhn -m 1024 -L
deepstrom -e 50 -s 64 -v 10000 -a 1 -t 2000 --svhn -m 16 -C
deepstrom -e 50 -s 64 -v 10000 -a 1 -t 2000 --svhn -m 16 -L
deepstrom -e 50 -s 64 -v 10000 -a 1 -t 2000 --svhn -m 64 -C
deepstrom -e 50 -s 64 -v 10000 -a 1 -t 2000 --svhn -m 64 -L
deepstrom -e 50 -s 64 -v 10000 -a 1 -t 2000 --svhn -m 128 -C
deepstrom -e 50 -s 64 -v 10000 -a 1 -t 2000 --svhn -m 128 -L
deepstrom -e 50 -s 64 -v 10000 -a 1 -t 2000 --svhn -m 256 -C
deepstrom -e 50 -s 64 -v 10000 -a 1 -t 2000 --svhn -m 256 -L
deepstrom -e 50 -s 64 -v 10000 -a 1 -t 2000 --svhn -m 512 -C
deepstrom -e 50 -s 64 -v 10000 -a 1 -t 2000 --svhn -m 512 -L
deepstrom -e 50 -s 64 -v 10000 -a 1 -t 2000 --svhn -m 1024 -C
deepstrom -e 50 -s 64 -v 10000 -a 1 -t 2000 --svhn -m 1024 -L
deepstrom -e 50 -s 64 -v 10000 -a 2 -t 20 --svhn -m 16 -C
deepstrom -e 50 -s 64 -v 10000 -a 2 -t 20 --svhn -m 16 -L
deepstrom -e 50 -s 64 -v 10000 -a 2 -t 20 --svhn -m 64 -C
deepstrom -e 50 -s 64 -v 10000 -a 2 -t 20 --svhn -m 64 -L
deepstrom -e 50 -s 64 -v 10000 -a 2 -t 20 --svhn -m 128 -C
deepstrom -e 50 -s 64 -v 10000 -a 2 -t 20 --svhn -m 128 -L
deepstrom -e 50 -s 64 -v 10000 -a 2 -t 20 --svhn -m 256 -C
deepstrom -e 50 -s 64 -v 10000 -a 2 -t 20 --svhn -m 256 -L
deepstrom -e 50 -s 64 -v 10000 -a 2 -t 20 --svhn -m 512 -C
deepstrom -e 50 -s 64 -v 10000 -a 2 -t 20 --svhn -m 512 -L
deepstrom -e 50 -s 64 -v 10000 -a 2 -t 20 --svhn -m 1024 -C
deepstrom -e 50 -s 64 -v 10000 -a 2 -t 20 --svhn -m 1024 -L
deepstrom -e 50 -s 64 -v 10000 -a 2 -t 50 --svhn -m 16 -C
deepstrom -e 50 -s 64 -v 10000 -a 2 -t 50 --svhn -m 16 -L
deepstrom -e 50 -s 64 -v 10000 -a 2 -t 50 --svhn -m 64 -C
deepstrom -e 50 -s 64 -v 10000 -a 2 -t 50 --svhn -m 64 -L
deepstrom -e 50 -s 64 -v 10000 -a 2 -t 50 --svhn -m 128 -C
deepstrom -e 50 -s 64 -v 10000 -a 2 -t 50 --svhn -m 128 -L
deepstrom -e 50 -s 64 -v 10000 -a 2 -t 50 --svhn -m 256 -C
deepstrom -e 50 -s 64 -v 10000 -a 2 -t 50 --svhn -m 256 -L
deepstrom -e 50 -s 64 -v 10000 -a 2 -t 50 --svhn -m 512 -C
deepstrom -e 50 -s 64 -v 10000 -a 2 -t 50 --svhn -m 512 -L
deepstrom -e 50 -s 64 -v 10000 -a 2 -t 50 --svhn -m 1024 -C
deepstrom -e 50 -s 64 -v 10000 -a 2 -t 50 --svhn -m 1024 -L
deepstrom -e 50 -s 64 -v 10000 -a 2 -t 100 --svhn -m 16 -C
deepstrom -e 50 -s 64 -v 10000 -a 2 -t 100 --svhn -m 16 -L
deepstrom -e 50 -s 64 -v 10000 -a 2 -t 100 --svhn -m 64 -C
deepstrom -e 50 -s 64 -v 10000 -a 2 -t 100 --svhn -m 64 -L
deepstrom -e 50 -s 64 -v 10000 -a 2 -t 100 --svhn -m 128 -C
deepstrom -e 50 -s 64 -v 10000 -a 2 -t 100 --svhn -m 128 -L
deepstrom -e 50 -s 64 -v 10000 -a 2 -t 100 --svhn -m 256 -C
deepstrom -e 50 -s 64 -v 10000 -a 2 -t 100 --svhn -m 256 -L
deepstrom -e 50 -s 64 -v 10000 -a 2 -t 100 --svhn -m 512 -C
deepstrom -e 50 -s 64 -v 10000 -a 2 -t 100 --svhn -m 512 -L
deepstrom -e 50 -s 64 -v 10000 -a 2 -t 100 --svhn -m 1024 -C
deepstrom -e 50 -s 64 -v 10000 -a 2 -t 100 --svhn -m 1024 -L
deepstrom -e 50 -s 64 -v 10000 -a 2 -t 200 --svhn -m 16 -C
deepstrom -e 50 -s 64 -v 10000 -a 2 -t 200 --svhn -m 16 -L
deepstrom -e 50 -s 64 -v 10000 -a 2 -t 200 --svhn -m 64 -C
deepstrom -e 50 -s 64 -v 10000 -a 2 -t 200 --svhn -m 64 -L
deepstrom -e 50 -s 64 -v 10000 -a 2 -t 200 --svhn -m 128 -C
deepstrom -e 50 -s 64 -v 10000 -a 2 -t 200 --svhn -m 128 -L
deepstrom -e 50 -s 64 -v 10000 -a 2 -t 200 --svhn -m 256 -C
deepstrom -e 50 -s 64 -v 10000 -a 2 -t 200 --svhn -m 256 -L
deepstrom -e 50 -s 64 -v 10000 -a 2 -t 200 --svhn -m 512 -C
deepstrom -e 50 -s 64 -v 10000 -a 2 -t 200 --svhn -m 512 -L
deepstrom -e 50 -s 64 -v 10000 -a 2 -t 200 --svhn -m 1024 -C
deepstrom -e 50 -s 64 -v 10000 -a 2 -t 200 --svhn -m 1024 -L
deepstrom -e 50 -s 64 -v 10000 -a 2 -t 500 --svhn -m 16 -C
deepstrom -e 50 -s 64 -v 10000 -a 2 -t 500 --svhn -m 16 -L
deepstrom -e 50 -s 64 -v 10000 -a 2 -t 500 --svhn -m 64 -C
deepstrom -e 50 -s 64 -v 10000 -a 2 -t 500 --svhn -m 64 -L
deepstrom -e 50 -s 64 -v 10000 -a 2 -t 500 --svhn -m 128 -C
deepstrom -e 50 -s 64 -v 10000 -a 2 -t 500 --svhn -m 128 -L
deepstrom -e 50 -s 64 -v 10000 -a 2 -t 500 --svhn -m 256 -C
deepstrom -e 50 -s 64 -v 10000 -a 2 -t 500 --svhn -m 256 -L
deepstrom -e 50 -s 64 -v 10000 -a 2 -t 500 --svhn -m 512 -C
deepstrom -e 50 -s 64 -v 10000 -a 2 -t 500 --svhn -m 512 -L
deepstrom -e 50 -s 64 -v 10000 -a 2 -t 500 --svhn -m 1024 -C
deepstrom -e 50 -s 64 -v 10000 -a 2 -t 500 --svhn -m 1024 -L
deepstrom -e 50 -s 64 -v 10000 -a 2 -t 1000 --svhn -m 16 -C
deepstrom -e 50 -s 64 -v 10000 -a 2 -t 1000 --svhn -m 16 -L
deepstrom -e 50 -s 64 -v 10000 -a 2 -t 1000 --svhn -m 64 -C
deepstrom -e 50 -s 64 -v 10000 -a 2 -t 1000 --svhn -m 64 -L
deepstrom -e 50 -s 64 -v 10000 -a 2 -t 1000 --svhn -m 128 -C
deepstrom -e 50 -s 64 -v 10000 -a 2 -t 1000 --svhn -m 128 -L
deepstrom -e 50 -s 64 -v 10000 -a 2 -t 1000 --svhn -m 256 -C
deepstrom -e 50 -s 64 -v 10000 -a 2 -t 1000 --svhn -m 256 -L
deepstrom -e 50 -s 64 -v 10000 -a 2 -t 1000 --svhn -m 512 -C
deepstrom -e 50 -s 64 -v 10000 -a 2 -t 1000 --svhn -m 512 -L
deepstrom -e 50 -s 64 -v 10000 -a 2 -t 1000 --svhn -m 1024 -C
deepstrom -e 50 -s 64 -v 10000 -a 2 -t 1000 --svhn -m 1024 -L
deepstrom -e 50 -s 64 -v 10000 -a 2 -t 2000 --svhn -m 16 -C
deepstrom -e 50 -s 64 -v 10000 -a 2 -t 2000 --svhn -m 16 -L
deepstrom -e 50 -s 64 -v 10000 -a 2 -t 2000 --svhn -m 64 -C
deepstrom -e 50 -s 64 -v 10000 -a 2 -t 2000 --svhn -m 64 -L
deepstrom -e 50 -s 64 -v 10000 -a 2 -t 2000 --svhn -m 128 -C
deepstrom -e 50 -s 64 -v 10000 -a 2 -t 2000 --svhn -m 128 -L
deepstrom -e 50 -s 64 -v 10000 -a 2 -t 2000 --svhn -m 256 -C
deepstrom -e 50 -s 64 -v 10000 -a 2 -t 2000 --svhn -m 256 -L
deepstrom -e 50 -s 64 -v 10000 -a 2 -t 2000 --svhn -m 512 -C
deepstrom -e 50 -s 64 -v 10000 -a 2 -t 2000 --svhn -m 512 -L
deepstrom -e 50 -s 64 -v 10000 -a 2 -t 2000 --svhn -m 1024 -C
deepstrom -e 50 -s 64 -v 10000 -a 2 -t 2000 --svhn -m 1024 -L
