{
    "2021-07-09_09h04": [
        "20210709_090422",
        "20210709_090626",
        "20210709_090831",
        "20210709_091036",
        "20210709_091241",
        "20210709_091446",
        "20210709_091651"
    ],
    "2021-07-09_09h34": [
        "20210709_093437",
        "20210709_093641",
        "20210709_093846",
        "20210709_094051",
        "20210709_094256",
        "20210709_094501",
        "20210709_094706",
        "20210709_094911",
        "20210709_095116",
        "20210709_095321",
        "20210709_095526",
        "20210709_095731",
        "20210709_095936",
        "20210709_100141",
        "20210709_100346",
        "20210709_100551",
        "20210709_100756",
        "20210709_101001",
        "20210709_101206",
        "20210709_101411",
        "20210709_101616",
        "20210709_101821",
        "20210709_102026",
        "20210709_102231"
    ],
    "2021-07-09_10h55": [
        "20210709_105548",
        "20210709_105752",
        "20210709_105957",
        "20210709_110202"
    ],
    "2021-07-09_11h54": [
        "20210709_115436",
        "20210709_115640",
        "20210709_115845",
        "20210709_120050",
        "20210709_120255",
        "20210709_120500",
        "20210709_120705",
        "20210709_120910"
    ],
    "2021-07-09_12h27": [
        "20210709_122712",
        "20210709_122916",
        "20210709_123120"
    ],
    "2021-07-09_12h42": [
        "20210709_124228",
        "20210709_124432"
    ],
    "2021-07-09_12h50": [
        "20210709_125012",
        "20210709_125216",
        "20210709_125421",
        "20210709_125626",
        "20210709_125831"
    ],
    "2021-07-09_13h10": [
        "20210709_131046",
        "20210709_131250",
        "20210709_131455",
        "20210709_131700",
        "20210709_131905",
        "20210709_132110",
        "20210709_132315",
        "20210709_132520",
        "20210709_132725",
        "20210709_132930",
        "20210709_133135",
        "20210709_133340",
        "20210709_133545",
        "20210709_133750",
        "20210709_133955",
        "20210709_134200",
        "20210709_134405",
        "20210709_134610",
        "20210709_134815",
        "20210709_135020",
        "20210709_135224",
        "20210709_135429",
        "20210709_135634"
    ],
    "2021-07-09_14h08": [
        "20210709_140838",
        "20210709_141042",
        "20210709_141247"
    ]
}