{
    "Line1": [
        [
            0.8279071239517883,
            7653.188650909726
        ],
        [
            0.8827786198598395,
            8978.564620783212
        ],
        [
            0.940393690563293,
            10429.313993212298
        ],
        [
            0.9788037376989289,
            11342.748783260242
        ],
        [
            1.0227009344253697,
            11754.689963085784
        ],
        [
            1.1297003514460693,
            12363.646489784413
        ],
        [
            1.1461618002184846,
            12489.019892340013
        ],
        [
            1.1818282725587177,
            13044.244960800528
        ]
    ],
    "Line2": [
        [
            1.2147511701035483,
            13223.349821594242
        ],
        [
            1.2805969651932096,
            11629.316560530184
        ],
        [
            1.3190070123288453,
            10554.687395767898
        ],
        [
            1.3848528074185067,
            10321.851076736071
        ],
        [
            1.4918522244392063,
            11181.554408545899
        ],
        [
            1.5494672951426598,
            11539.764130133328
        ],
        [
            1.6235438146185288,
            12256.183573308186
        ],
        [
            1.725056082048423,
            13115.886905118014
        ],
        [
            1.8073633259104995,
            13850.216834372242
        ],
        [
            1.8540040974323433,
            14262.158014197785
        ],
        [
            1.922593467317407,
            14584.546763626471
        ],
        [
            1.9747213884300554,
            14226.337042039042
        ],
        [
            1.9939264119978732,
            13939.7692647691
        ],
        [
            2.043310758315119,
            11969.61579603824
        ],
        [
            2.057028632292132,
            11736.779477006414
        ]
    ],
    "Line3": [
        [
            1.4233024230234295,
            15793.087663039913
        ],
        [
            1.4567654945442203,
            15847.008750399547
        ],
        [
            1.4973393740300114,
            15712.907386626872
        ],
        [
            1.5741594683012827,
            15300.96620680133
        ],
        [
            1.5898016081512676,
            15149.886120964264
        ],
        [
            1.6616247860495506,
            14556.754160008275
        ],
        [
            1.7223125072530205,
            13903.948292610357
        ],
        [
            1.7415175308208384,
            13545.738571022928
        ],
        [
            1.7689532787748639,
            13097.976419038643
        ],
        [
            1.804619751115097,
            13044.244960800528
        ]
    ],
    "Line4": [
        [
            2.062515781882937,
            15909.922733499958
        ],
        [
            2.144823025745014,
            15856.191275261843
        ],
        [
            2.221643120016285,
            15444.2500954363
        ],
        [
            2.2820017655151412,
            15068.1298877695
        ],
        [
            2.3505911354002054,
            14351.710444594642
        ],
        [
            2.4575905524209047,
            13330.812738070472
        ]
    ],
    "Line5": [
        [
            2.263435869670417,
            4802.36577599648
        ],
        [
            2.3675728101792703,
            6544.374633090646
        ],
        [
            2.432412792005537,
            7457.660830013801
        ],
        [
            2.4952879258976752,
            7829.740391723236
        ],
        [
            2.5581630597898126,
            8337.1216122361
        ],
        [
            2.6249678895502093,
            8726.113881295962
        ],
        [
            2.6406866730232434,
            8979.804491552395
        ],
        [
            2.6603351523645364,
            9757.78902967212
        ],
        [
            2.6878430234423467,
            10400.471908988415
        ],
        [
            2.715350894520157,
            10755.638763347419
        ],
        [
            2.780190876346424,
            11076.980203005567
        ],
        [
            2.9059411441306997,
            11838.052033774862
        ],
        [
            2.935413863142639,
            12041.004521980009
        ],
        [
            2.966851430088708,
            12260.869717535583
        ]
    ],
    "Line6": [
        [
            3.3104121993499467,
            13334.860323826499
        ],
        [
            3.3799611199422115,
            8807.450959213433
        ],
        [
            3.4193549619111545,
            7988.762532566792
        ],
        [
            3.4394671292953363,
            7996.155223796864
        ],
        [
            3.4577509178264103,
            7937.013693956284
        ],
        [
            3.4824340323433605,
            7988.762532566792
        ],
        [
            3.5436847239224587,
            8380.575167760635
        ],
        [
            3.6506448868292427,
            9363.803101360281
        ],
        [
            3.7054962524224653,
            10162.213754208113
        ],
        [
            3.7274367986597543,
            10317.460270039635
        ],
        [
            3.7795455959733157,
            11027.158628126599
        ],
        [
            3.8014861422106048,
            11226.761291338556
        ],
        [
            3.815914109996168,
            11174.836772007287
        ],
        [
            3.8277883159509445,
            11261.237714080056
        ],
        [
            3.868499879224466,
            12436.290526269708
        ],
        [
            3.9550119511806985,
            13455.821642728375
        ],
        [
            4.004205090136203,
            14475.352759187042
        ],
        [
            4.048309283682518,
            14492.632947601596
        ],
        [
            4.069100408474739,
            14344.687511838605
        ],
        [
            4.105983998320006,
            14319.831063456058
        ]
    ],
    "Line7": [
        [
            4.810833396219904,
            15201.233225735392
        ],
        [
            4.854177286793641,
            11536.75266151801
        ],
        [
            4.882141087163795,
            10713.455266033048
        ],
        [
            4.917095837626486,
            10439.022800871393
        ],
        [
            4.96882886831127,
            10842.599955520885
        ],
        [
            5.031747419144115,
            11213.890937798416
        ],
        [
            5.103055110088006,
            11536.75266151801
        ],
        [
            5.153389950754281,
            11891.900557609562
        ],
        [
            5.22609583171668,
            12473.05166030483
        ],
        [
            5.28621800251251,
            12828.199556396383
        ],
        [
            5.336552843178786,
            13215.633624859895
        ],
        [
            5.379896733752524,
            13780.641641369182
        ],
        [
            5.41764786425223,
            14587.795950668165
        ],
        [
            5.490353745214629,
            15637.096552756842
        ],
        [
            5.582634286436135,
            16573.39555154366
        ],
        [
            5.652543787361518,
            17106.117395680994
        ],
        [
            5.676313017676149,
            17315.977516098726
        ],
        [
            5.749018898638547,
            18736.569100464934
        ]
    ],
    "Line8": [
        [
            5.110470876680722,
            14055.611525521419
        ],
        [
            5.134647670022662,
            13783.16994336053
        ],
        [
            5.174942325592563,
            13535.495777759723
        ],
        [
            5.207178050048484,
            13448.809819799439
        ],
        [
            5.307108795861839,
            12829.624405797418
        ],
        [
            5.442498838576706,
            11851.311451674226
        ],
        [
            5.560159232840817,
            11033.98670519156
        ],
        [
            5.6310778266438435,
            10352.882749789336
        ],
        [
            5.689102130664501,
            9807.99958546756
        ],
        [
            5.816433242265388,
            9201.19787974558
        ],
        [
            5.89702255340519,
            9238.3490045857
        ]
    ],
    "Line9": [
        [
            8.436134209471177,
            10745.632363427392
        ],
        [
            8.478470869950536,
            12324.229717535358
        ],
        [
            8.517783483252797,
            14024.257637343937
        ],
        [
            8.544999907846671,
            14412.835447585898
        ],
        [
            8.578264426794739,
            13587.107600821731
        ],
        [
            8.584312521148933,
            13222.815903719893
        ],
        [
            8.626649181628292,
            11182.782399949598
        ],
        [
            8.652353582633616,
            10041.335082363838
        ],
        [
            8.705274408232816,
            7952.729352313298
        ],
        [
            8.723418691295397,
            7952.729352313298
        ],
        [
            8.749123092300723,
            8924.1738779182
        ],
        [
            8.795995823545727,
            10259.91010062494
        ],
        [
            8.826236295316697,
            11109.92406052923
        ],
        [
            8.850428672733473,
            12275.657491255113
        ],
        [
            8.900325451155574,
            14169.974316184673
        ],
        [
            8.929053899337998,
            14169.974316184673
        ],
        [
            8.966854489051709,
            12445.660283235971
        ],
        [
            9.019775314650907,
            10672.774024007023
        ]
    ],
    "Line10": [
        [
            10.751601750085882,
            15801.68743171478
        ],
        [
            10.816220469284147,
            15877.828241625784
        ],
        [
            10.957964756557761,
            15211.596154904502
        ],
        [
            11.12680721639839,
            13707.815159162179
        ]
    ],
    "Line11": [
        [
            11.160158813403946,
            10452.795535466776
        ],
        [
            11.20184830966089,
            11042.886812277055
        ],
        [
            11.260213604420613,
            11899.470923775843
        ],
        [
            11.337339172495962,
            12565.703010497125
        ],
        [
            11.426971589448396,
            12851.23104766339
        ]
    ],
    "Line12": [
        [
            11.449900812389714,
            15782.65222923703
        ],
        [
            11.483546419507608,
            15612.685399442676
        ],
        [
            11.556209027844925,
            15516.159394548517
        ],
        [
            11.591624680128742,
            15248.824797114487
        ],
        [
            11.608071371962392,
            15150.279217317267
        ],
        [
            11.635090937117676,
            15082.055354380733
        ],
        [
            11.668770667738677,
            14830.892105349483
        ],
        [
            11.697353413345068,
            14551.425309318787
        ],
        [
            11.776062581406112,
            13884.347538383772
        ],
        [
            11.797208328049377,
            13800.962817016894
        ]
    ],
    "Line13": [
        [
            11.329001273244574,
            14926.068117738238
        ],
        [
            11.364437345062978,
            16315.637898614055
        ],
        [
            11.437393963512632,
            17552.926059667865
        ],
        [
            11.483252409395272,
            17762.313286923123
        ],
        [
            11.524941905652216,
            17686.17247701212
        ],
        [
            11.58330720041194,
            17134.15160515734
        ],
        [
            11.612489847791801,
            16201.42668374755
        ],
        [
            11.685446466241455,
            13726.850361639932
        ],
        [
            11.762572034316804,
            12432.45659315287
        ],
        [
            11.829275228327917,
            11747.189303953837
        ],
        [
            11.879302623836251,
            11328.414849443318
        ],
        [
            11.908485271216113,
            11309.379646965566
        ]
    ],
    "Line14": [
        [
            14.535625691873653,
            8677.791032301802
        ],
        [
            14.575638674144878,
            8723.358793519477
        ],
        [
            14.630656524767812,
            8677.791032301802
        ],
        [
            14.733189791837827,
            8768.92655473715
        ],
        [
            14.825719813340033,
            9254.982674392351
        ]
    ],
    "Line15": [
        [
            16.471464271136195,
            11509.473582941342
        ],
        [
            16.520023777405054,
            12154.713746104764
        ],
        [
            16.57280584943642,
            12683.599125746914
        ],
        [
            16.60869765841775,
            12916.30869278946
        ],
        [
            16.63403305299281,
            12937.464107975145
        ]
    ],
    "Line16": [
        [
            16.64881203316159,
            15740.556620078538
        ],
        [
            16.75226489434307,
            15560.735591000208
        ],
        [
            16.862051604168315,
            14947.228550615313
        ],
        [
            17.001396274331125,
            13582.70427113857
        ]
    ],
    "Line17": [
        [
            18.512828317168804,
            10322.654963049392
        ],
        [
            18.630843618545075,
            9521.495115705213
        ],
        [
            18.679589069113536,
            9464.269412323487
        ],
        [
            18.725768969652076,
            9349.818005560033
        ],
        [
            18.761686670070944,
            9281.14716150196
        ]
    ],
    "Line18": [
        [
            19.46322605599245,
            10134.815232322737
        ],
        [
            19.501684426314867,
            9887.237506250809
        ],
        [
            19.525093869119814,
            9660.29125735154
        ],
        [
            19.590305888362167,
            9361.13483834796
        ],
        [
            19.622075846454596,
            9278.608929657315
        ],
        [
            19.67056683512199,
            9061.978419344377
        ],
        [
            19.74246726659433,
            8845.34790903144
        ],
        [
            19.80935138889418,
            8927.873817722084
        ],
        [
            19.85951448061907,
            9371.45057693429
        ],
        [
            19.889612335654,
            10093.552277977416
        ]
    ],
    "Line19": [
        [
            19.84769068847274,
            8356.498762639869
        ],
        [
            19.89817859142724,
            7793.2102477001845
        ],
        [
            19.928097348733612,
            7730.622634929108
        ],
        [
            19.946796572050097,
            8131.183356663994
        ],
        [
            19.97484540702482,
            8556.779123507311
        ],
        [
            19.99541455267295,
            8631.884258832602
        ],
        [
            20.01785362065273,
            8757.059484374753
        ],
        [
            20.077691135265475,
            8957.339845242197
        ],
        [
            20.102000125576904,
            8969.857367796412
        ],
        [
            20.122569271225032,
            9057.480025675919
        ],
        [
            20.165577484852943,
            9069.997548230134
        ]
    ],
    "Line20": [
        [
            19.986862211112616,
            12689.258119718383
        ],
        [
            20.040627426592362,
            12990.756868527187
        ],
        [
            20.125411035618118,
            13141.506242931591
        ],
        [
            20.187447822710133,
            13078.694003596423
        ],
        [
            20.24741671689908,
            13116.381347197523
        ],
        [
            20.31152139689416,
            12990.756868527187
        ],
        [
            20.412848149144452,
            12714.38301545245
        ],
        [
            20.512107008491675,
            11985.761039164503
        ]
    ],
    "Line21": [
        [
            20.292057057207074,
            10751.175715892812
        ],
        [
            20.328461740050294,
            10910.972562482524
        ],
        [
            20.352731528612438,
            11053.948688378585
        ],
        [
            20.402787967521864,
            11121.231571153201
        ],
        [
            20.442226373935352,
            11255.797336702433
        ],
        [
            20.48621536570424,
            11524.9288678009
        ],
        [
            20.543856113539338,
            12004.319407570041
        ]
    ],
    "Line22": [
        [
            19.689862928508827,
            10482.044184794346
        ],
        [
            19.76570601776553,
            10877.331121095216
        ],
        [
            19.833964798096567,
            11323.08021947705
        ],
        [
            19.876436928080324,
            11432.414903985802
        ],
        [
            19.932560814130287,
            11752.00859716523
        ],
        [
            19.997785870891054,
            12281.861299015332
        ],
        [
            20.049359171585614,
            12862.176162946398
        ]
    ],
    "Line23": [
        [
            20.93004635941097,
            11224.77314041383
        ],
        [
            20.950262667836864,
            10628.571786066044
        ],
        [
            20.974522237947934,
            10543.400164016362
        ],
        [
            21.000129561954065,
            11071.4642207244
        ],
        [
            21.032475655435494,
            11872.077467991425
        ],
        [
            21.07964704176258,
            13115.583149916803
        ]
    ],
    "Line24": [
        [
            20.844865129415556,
            9833.673006423624
        ],
        [
            20.870813265930806,
            10974.260848902917
        ],
        [
            20.903680905516794,
            11907.469083658703
        ],
        [
            20.952117427011935,
            12633.297710690982
        ],
        [
            20.995364321204022,
            13635.632481354602
        ],
        [
            21.01785270618391,
            13825.730455101151
        ],
        [
            21.061099600375996,
            13998.546794870741
        ],
        [
            21.135484258386388,
            13894.856991008986
        ],
        [
            21.2185182952352,
            13773.885553170274
        ],
        [
            21.329230344366945,
            13376.407971700217
        ],
        [
            21.398425375074286,
            13065.338560114957
        ],
        [
            21.529895933418235,
            12356.791567059638
        ],
        [
            21.580062330681056,
            12218.538495243965
        ],
        [
            21.61955923219274,
            11724.821312739201
        ],
        [
            21.6632865497696,
            11293.34758468005
        ],
        [
            21.75677253907186,
            11509.084448709626
        ],
        [
            21.912079908396585,
            12079.246160787789
        ],
        [
            22.001042382087448,
            12757.27630488074
        ],
        [
            22.061355923572776,
            13096.291376927213
        ],
        [
            22.195553553377636,
            13974.648609047626
        ],
        [
            22.273961157308563,
            14575.629873130016
        ],
        [
            22.328243344645358,
            15315.299121231415
        ]
    ],
    "Line25": [
        [
            21.366343144772674,
            14774.520447591578
        ],
        [
            21.4133211739398,
            13817.096820978124
        ],
        [
            21.423286210429794,
            13541.673585924938
        ],
        [
            21.430404093636934,
            13502.327409488767
        ],
        [
            21.451757743258355,
            13489.212017343378
        ],
        [
            21.461722779748353,
            13318.711919453312
        ],
        [
            21.471687816238347,
            12269.480547822128
        ],
        [
            21.49019431257691,
            11403.8646662264
        ],
        [
            21.51297153883976,
            10984.172117573928
        ],
        [
            21.532901611819753,
            10879.248980410808
        ],
        [
            21.552831684799745,
            11115.326039027826
        ],
        [
            21.567067451214026,
            11259.595352627113
        ],
        [
            21.61404548038115,
            11364.51848979023
        ],
        [
            21.67098854603827,
            11587.480156261858
        ],
        [
            21.739320224826816,
            11889.134175605823
        ],
        [
            21.801957597049647,
            12098.98044993206
        ],
        [
            21.84324131965106,
            12400.634469276025
        ],
        [
            21.92296161157103,
            13226.904174435582
        ],
        [
            22.035424166243843,
            13974.4815267228
        ],
        [
            22.129380224578092,
            14853.212800463916
        ],
        [
            22.18205256031093,
            15548.328584169576
        ],
        [
            22.243266355892334,
            16007.367309258218
        ],
        [
            22.338645990868013,
            17109.06024947096
        ],
        [
            22.365693947055142,
            17489.406621687267
        ],
        [
            22.392741903242275,
            17554.983582414214
        ],
        [
            22.414095552863696,
            17764.82985674045
        ],
        [
            22.438296355767974,
            17948.44534677591
        ]
    ],
    "Line26": [
        [
            21.158118497802917,
            11384.723494554239
        ],
        [
            21.223669944670377,
            17974.219459758286
        ],
        [
            21.2402169118408,
            18264.9325170467
        ],
        [
            21.255491035382732,
            18090.50468267365
        ],
        [
            21.31416612210151,
            13396.92329867596
        ],
        [
            21.31653865628896,
            13041.623981576686
        ],
        [
            21.322315325878687,
            9562.921668880179
        ],
        [
            21.323656258851297,
            9536.00405286385
        ],
        [
            21.347135776634325,
            9911.777337626276
        ],
        [
            21.369525253141916,
            10696.648488721477
        ],
        [
            21.3751383364612,
            10977.72521435046
        ],
        [
            21.385321085489156,
            13419.714895573135
        ],
        [
            21.393594569074367,
            14253.092326466587
        ],
        [
            21.404757982202504,
            16353.397693771009
        ],
        [
            21.42953545744487,
            17592.624195225297
        ],
        [
            21.459728347256615,
            17904.141489586316
        ],
        [
            21.491479145550784,
            17560.84915672647
        ],
        [
            21.510696182895845,
            17121.461158378937
        ],
        [
            21.549706212370346,
            14542.22049933782
        ],
        [
            21.578200308899067,
            13302.993997883532
        ],
        [
            21.609172152952024,
            13048.79368989291
        ],
        [
            21.63642737571863,
            12826.368420401113
        ],
        [
            21.655010482150402,
            12476.842996914007
        ],
        [
            21.689698947489717,
            12254.417727422213
        ]
    ],
    "Line27": [
        [
            22.60567699602125,
            11841.182613234861
        ],
        [
            22.688183554299364,
            12063.988863954299
        ],
        [
            22.755881243142944,
            12191.306721508263
        ],
        [
            22.821463379210165,
            12063.988863954299
        ],
        [
            22.865889987513764,
            11713.864755680896
        ]
    ],
    "Line28": [
        [
            22.631063629337593,
            13066.616992191772
        ],
        [
            22.702992423733896,
            12780.151812695349
        ],
        [
            22.777036770906566,
            12636.919222947141
        ],
        [
            22.832041143091974,
            12493.68663319893
        ],
        [
            22.876467751395573,
            12191.306721508263
        ],
        [
            22.952627651344603,
            11475.143772767213
        ],
        [
            22.967436520779135,
            11284.166986436265
        ]
    ],
    "Line29": [
        [
            23.619026775898604,
            12557.345561975912
        ],
        [
            23.680377806413098,
            12445.942436616193
        ],
        [
            23.733266625822147,
            12175.391989314017
        ],
        [
            23.815773184100262,
            11602.461630321177
        ],
        [
            23.944821903458337,
            10456.600912335494
        ]
    ],
    "Line30": [
        [
            24.673422577494254,
            13372.737269639312
        ],
        [
            24.683206172309077,
            15048.71723745933
        ],
        [
            24.704403961074526,
            16772.582347217063
        ],
        [
            24.7370159437906,
            17634.51490209593
        ],
        [
            24.779411521321496,
            17251.43376659421
        ],
        [
            24.79571751267953,
            16724.69720527935
        ],
        [
            24.831590693667213,
            10427.801040469853
        ],
        [
            24.849527284161052,
            10116.547617874705
        ],
        [
            24.8707250729265,
            10379.915898532137
        ],
        [
            24.87398627119811,
            10499.628753376424
        ],
        [
            24.88703106428454,
            10619.341608220711
        ],
        [
            24.910268909101035,
            14374.127297307467
        ],
        [
            24.963368363526317,
            17636.72921509438
        ],
        [
            24.98685466067596,
            17747.325890273594
        ],
        [
            25.019531248014594,
            17415.535864735943
        ],
        [
            25.040975258455575,
            17231.20807277058
        ],
        [
            25.047102118581567,
            17157.476955984435
        ],
        [
            25.084884422691864,
            14613.753426862437
        ],
        [
            25.11041300655017,
            13415.622779087582
        ],
        [
            25.132878160345484,
            13268.160545515293
        ],
        [
            25.14104730718014,
            13249.727766318756
        ],
        [
            25.16249131762112,
            12659.878832029597
        ],
        [
            25.20537933850308,
            11093.092600324017
        ],
        [
            25.245203929322038,
            11019.361483537872
        ],
        [
            25.288091950204,
            11277.42039228938
        ],
        [
            25.347318264755273,
            11664.508755416638
        ],
        [
            25.410629152723878,
            12070.029897740438
        ],
        [
            25.49538405113346,
            12475.551040064234
        ],
        [
            25.553589222330405,
            12936.37051997764
        ],
        [
            25.605667533401352,
            13212.862207925682
        ],
        [
            25.72616244921257,
            14060.77005096635
        ],
        [
            25.778240760283516,
            14503.156751683218
        ],
        [
            25.78795712705253,
            14706.494009709015
        ],
        [
            25.79634981670084,
            15503.846353597412
        ],
        [
            25.80683277420482,
            15848.749633030366
        ],
        [
            25.820129104037733,
            16018.267220622183
        ]
    ],
    "Line31": [
        [
            28.812750541306915,
            15144.607355278227
        ],
        [
            28.871251812903136,
            14555.653308551511
        ],
        [
            28.941453338818604,
            14184.830390242098
        ],
        [
            28.99020439848212,
            13901.259923299604
        ],
        [
            29.025305161439857,
            13464.997666464998
        ],
        [
            29.077956305876455,
            12963.296071105204
        ],
        [
            29.152057916565006,
            12439.78136290368
        ]
    ],
    "Line32": [
        [
            28.67234748947598,
            12897.856732580014
        ],
        [
            28.699648082887553,
            13072.361635313855
        ],
        [
            28.726948676299124,
            12963.296071105204
        ],
        [
            28.750349184937612,
            12614.286265637522
        ],
        [
            28.7737496935761,
            12505.220701428869
        ],
        [
            28.834201007558864,
            12308.902685853296
        ],
        [
            28.900502448701246,
            12090.771557435994
        ],
        [
            28.98240422893596,
            11894.453541860423
        ]
    ],
    "Line33": [
        [
            28.221887698185068,
            13617.689456357111
        ],
        [
            28.5631451158297,
            18460.200507221223
        ]
    ],
    "Line34": [
        [
            29.68285490797515,
            11418.38631314353
        ],
        [
            29.722062146422655,
            12459.110066221827
        ],
        [
            29.75881893246719,
            12696.989781211152
        ],
        [
            29.82008024254142,
            12459.110066221827
        ],
        [
            29.861737933391893,
            12459.110066221827
        ],
        [
            29.92054879106315,
            12102.29049373784
        ],
        [
            29.910746981451275,
            12236.097833419335
        ],
        [
            29.942602862689874,
            12117.157975924672
        ],
        [
            30.011215529973008,
            12161.760422485171
        ],
        [
            30.099431816479896,
            12027.953082803677
        ],
        [
            30.182747198180845,
            11864.410778748515
        ],
        [
            30.231756246240227,
            11656.266028132855
        ],
        [
            30.27831484189664,
            11596.796099385523
        ],
        [
            30.319972532747116,
            11477.856241890862
        ],
        [
            30.425341986074788,
            10972.361847538545
        ]
    ],
    "Line35": [
        [
            31.066465171405223,
            16617.920890180118
        ],
        [
            31.14198104089182,
            14554.025629010244
        ],
        [
            31.261216624291716,
            12715.597917379939
        ],
        [
            31.327458615069435,
            11935.133322819904
        ],
        [
            31.369853489167173,
            11536.22919671144
        ],
        [
            31.445369358653775,
            10547.640710268726
        ],
        [
            31.506311990169273,
            9611.083196796684
        ]
    ],
    "Line36": [
        [
            31.363091149760862,
            13664.853672490797
        ],
        [
            31.417364737330264,
            13630.041864611932
        ],
        [
            31.527922045342006,
            13125.270650368377
        ],
        [
            31.654560416337272,
            12533.469916427659
        ],
        [
            31.74903666136549,
            11837.233758850343
        ],
        [
            31.813360913299594,
            11576.14519975885
        ],
        [
            31.843512906393705,
            11489.115680061685
        ]
    ],
    "Line37": [
        [
            31.610337493132576,
            15875.403472798775
        ],
        [
            31.63847935335375,
            15945.027088556506
        ],
        [
            31.70280360528785,
            15875.403472798775
        ],
        [
            31.793259584570187,
            15353.226354615788
        ],
        [
            31.82140144479136,
            14987.702371887697
        ],
        [
            31.869644633741935,
            14674.396100977905
        ],
        [
            31.937989151421924,
            13978.15994340059
        ]
    ],
    "Line38": [
        [
            31.817127052431914,
            8335.02586678178
        ],
        [
            31.897334621093837,
            8519.092249937696
        ],
        [
            31.946241675155985,
            8636.225402855096
        ],
        [
            32.00297385786808,
            8736.625248212868
        ],
        [
            32.10078796599237,
            9054.558091845813
        ]
    ],
    "Line39": [
        [
            33.36304516075602,
            12633.791987936136
        ],
        [
            33.42097288057432,
            12650.888878542579
        ],
        [
            33.455202896830585,
            12736.373331574792
        ],
        [
            33.50786446030176,
            12599.59820672325
        ],
        [
            33.555259867425825,
            12548.307534903923
        ],
        [
            33.62371989993836,
            12479.919972478152
        ],
        [
            33.676381463409534,
            12326.047957020168
        ],
        [
            33.79486998121968,
            12086.691488529972
        ],
        [
            33.9344231244183,
            11693.463004581792
        ],
        [
            33.99498392241016,
            11385.718973665826
        ],
        [
            34.06081087674913,
            11060.878052143415
        ]
    ],
    "Line40": [
        [
            33.34987976988823,
            13180.892487342298
        ],
        [
            33.41833980240076,
            12514.113753691037
        ],
        [
            33.51313061664888,
            12137.9821603493
        ],
        [
            33.61318758724412,
            11727.656785794677
        ]
    ],
    "Line41": [
        [
            36.06661517971192,
            16857.005654455475
        ],
        [
            36.12148322324676,
            16060.137532191951
        ],
        [
            36.15659877110907,
            15347.150264903532
        ],
        [
            36.21805097986809,
            13354.979959244714
        ],
        [
            36.25755597121318,
            12222.588417080755
        ],
        [
            36.299255684299666,
            11656.392645998774
        ],
        [
            36.31966835269944,
            11518.72987627537
        ],
        [
            36.326438501490316,
            11482.064826257241
        ],
        [
            36.33514297850716,
            10913.756550976228
        ],
        [
            36.339011634959085,
            10858.758975949033
        ],
        [
            36.41998571425394,
            10534.345555855392
        ],
        [
            36.421220584562604,
            10510.441000776796
        ],
        [
            36.42605640512752,
            9437.988287746495
        ],
        [
            36.42799073335348,
            9382.9907127193
        ],
        [
            36.45507132851699,
            9245.496775151312
        ],
        [
            36.490856400697346,
            8796.34991242922
        ],
        [
            36.51600266763489,
            8658.855974861232
        ],
        [
            36.5208384881998,
            8649.6897123567
        ]
    ],
    "Line42": [
        [
            39.11980990637569,
            12378.729272293967
        ],
        [
            39.212356497515934,
            12536.239544317708
        ],
        [
            39.28433717951389,
            12628.892645508146
        ],
        [
            39.346034906940716,
            12462.11706336536
        ],
        [
            39.47714257772272,
            12249.014930627356
        ],
        [
            39.531128089221184,
            12202.688380032138
        ],
        [
            39.56454769157738,
            12072.974038365528
        ],
        [
            39.649382066789265,
            12017.382177651267
        ],
        [
            39.74964087385786,
            11804.280044913263
        ],
        [
            39.798484908070755,
            11674.565703246652
        ],
        [
            39.82676303314138,
            11739.422874079957
        ],
        [
            39.86275337414037,
            11674.565703246652
        ],
        [
            39.89617297649656,
            11581.912602056216
        ]
    ],
    "Line43": [
        [
            41.5113004878321,
            11072.814185474983
        ],
        [
            41.534742119013615,
            12494.085757652323
        ],
        [
            41.5669743618882,
            13360.17312194789
        ],
        [
            41.60213680866046,
            14070.808908036559
        ],
        [
            41.63436905153504,
            14426.126801080894
        ],
        [
            41.66367109051193,
            15047.93311390848
        ],
        [
            41.729600678209934,
            16469.20468608582
        ]
    ],
    "Line44": [
        [
            41.944970664690075,
            13071.477333849367
        ],
        [
            41.97720290756465,
            12316.426811130155
        ],
        [
            42.02555127187652,
            9518.298403406017
        ],
        [
            42.035806985518434,
            9629.335244982372
        ],
        [
            42.06217882059763,
            10428.800504332125
        ],
        [
            42.10759698101181,
            11539.168920095672
        ],
        [
            42.12810840829563,
            11894.486813140007
        ],
        [
            42.26436288953817,
            13648.86891004641
        ]
    ],
    "Line45": [
        [
            41.15235051036521,
            14159.638381297644
        ],
        [
            41.206559282472455,
            13471.209963524243
        ],
        [
            41.21828009806321,
            13115.89207047991
        ],
        [
            41.22560560780743,
            12516.293125967593
        ],
        [
            41.24904723898894,
            10184.519452864144
        ],
        [
            41.25783785068201,
            10029.067874657248
        ],
        [
            41.26809356432392,
            10006.860506341978
        ],
        [
            41.28274458381237,
            10006.860506341978
        ],
        [
            41.29593050135197,
            10317.76366275577
        ],
        [
            41.34867417151037,
            11383.717341888776
        ]
    ],
    "Line46": [
        [
            49.412902360161425,
            7629.940582144908
        ],
        [
            49.44489518156913,
            7533.420372843701
        ],
        [
            49.48488620832876,
            7774.720896096718
        ],
        [
            49.58566359576303,
            10766.84738443412
        ],
        [
            49.62565462252266,
            11522.922357293573
        ],
        [
            49.68484134212691,
            11812.482985197192
        ],
        [
            49.75522554922386,
            12182.477120851818
        ],
        [
            49.83040867953196,
            12568.557958056645
        ],
        [
            49.89599396341775,
            12842.031884410062
        ],
        [
            49.983974222288936,
            13228.112721614889
        ],
        [
            50.0527587883155,
            13324.632930916094
        ],
        [
            50.131141200764375,
            13421.153140217302
        ]
    ],
    "Line47": [
        [
            50.096446083870454,
            15866.715303744038
        ],
        [
            50.24643932118455,
            12821.558521647297
        ],
        [
            50.360005629436664,
            11630.82413890434
        ],
        [
            50.482142979821,
            10127.765983638641
        ],
        [
            50.54642579581276,
            9073.673251374383
        ],
        [
            50.589281006473925,
            8683.268535720954
        ]
    ],
    "Line48": [
        [
            51.069259365879056,
            12470.19427755921
        ],
        [
            51.10354353440799,
            12216.431212384483
        ],
        [
            51.17425463199892,
            11455.142016860296
        ],
        [
            51.26210781385433,
            10674.332585553439
        ],
        [
            51.37567412210643,
            9815.442211115896
        ],
        [
            51.487097669825474,
            8429.505470546224
        ],
        [
            51.58137913328005,
            7297.331795151283
        ],
        [
            51.65851851247016,
            7199.7306162379255
        ],
        [
            51.78708414445368,
            7902.459104414097
        ],
        [
            51.917792536970246,
            8995.592308243697
        ],
        [
            52.012074000424825,
            11103.77777277221
        ],
        [
            52.06778577428435,
            12216.431212384483
        ],
        [
            52.132068590276106,
            12645.876399603254
        ],
        [
            52.162067237738924,
            12587.315692255237
        ],
        [
            52.22206453266457,
            12470.19427755921
        ]
    ],
    "Line49": [
        [
            53.70286260039733,
            13936.947605434485
        ],
        [
            53.749481267170445,
            13320.143886713591
        ],
        [
            53.797964680614484,
            12818.094348219838
        ],
        [
            53.88374302747702,
            11857.028088817511
        ],
        [
            53.95138525342069,
            11091.7706419389
        ],
        [
            54.046576137824985,
            9435.052625256318
        ],
        [
            54.12429534802629,
            8514.812589701958
        ],
        [
            54.204133463735545,
            8347.058703852832
        ],
        [
            54.38466789967473,
            8421.240107584887
        ],
        [
            54.52909544842608,
            8643.784318781056
        ]
    ],
    "Line50": [
        [
            57.39624862086182,
            9976.445915842489
        ],
        [
            57.43541600691199,
            12633.597229860246
        ],
        [
            57.44965869274842,
            12646.43370963811
        ],
        [
            57.48526540733949,
            12659.270189415973
        ],
        [
            57.50662943609413,
            12723.452588305292
        ],
        [
            57.54045581495564,
            13583.496733422151
        ],
        [
            57.5689411866285,
            14225.32072231533
        ],
        [
            57.62591192997421,
            14186.811282981736
        ],
        [
            57.71314838072232,
            14007.100566091649
        ],
        [
            57.77724046698625,
            13827.389849201558
        ],
        [
            57.835991546061514,
            13532.150814310695
        ],
        [
            57.90720497524365,
            13236.911779419834
        ],
        [
            57.98375941161444,
            12736.289068083155
        ],
        [
            58.070995862362565,
            12428.213553414429
        ],
        [
            58.10304190549453,
            12441.050033192292
        ],
        [
            58.12440593424917,
            12094.465079189977
        ],
        [
            58.133307612896935,
            11375.622211629616
        ],
        [
            58.16001264884024,
            11054.710217183027
        ],
        [
            58.17781600613577,
            11324.276292518163
        ],
        [
            58.209862049267734,
            11555.332928519707
        ],
        [
            58.22588507083371,
            11491.15052963039
        ],
        [
            58.31134118585228,
            11491.15052963039
        ],
        [
            58.370092264927536,
            11619.515327409024
        ],
        [
            58.432404015461906,
            11773.553084743387
        ],
        [
            58.51607979475092,
            12094.465079189977
        ],
        [
            58.60687691695814,
            12120.138038745703
        ]
    ]
}