{
    "Line1": [
        [
            30.243240444009132,
            10763.928953145762
        ],
        [
            30.269986066885462,
            11150.30823496423
        ],
        [
            30.31954413280337,
            11552.458099714062
        ],
        [
            30.37382201452298,
            11576.113974111111
        ],
        [
            30.41000726900272,
            11489.375767988598
        ],
        [
            30.431150122907372,
            11351.904038811472
        ],
        [
            30.45699117881786,
            11222.720778410207
        ],
        [
            30.48759145817605,
            11026.343266011283
        ],
        [
            30.554730824312642,
            10553.755047430364
        ],
        [
            30.610434364349047,
            10065.413888230081
        ],
        [
            30.639208378407588,
            9718.849194604074
        ],
        [
            30.65359538543686,
            9477.304105107161
        ],
        [
            30.6650899816568,
            9205.341422641266
        ],
        [
            30.676098140021104,
            8847.186480332603
        ],
        [
            30.68304360386251,
            8807.865192694226
        ],
        [
            30.694911918443996,
            8705.410014758327
        ],
        [
            30.711606184644328,
            8605.377301966488
        ],
        [
            30.73106388482524,
            8542.629628358232
        ],
        [
            30.75485809268536,
            8477.884926323097
        ]
    ],
    "Line2": [
        [
            33.47566487773979,
            21314.28865517546
        ],
        [
            33.53040560064938,
            20557.282136358277
        ],
        [
            33.57675929654217,
            19951.59694344801
        ],
        [
            33.598041761338585,
            19829.79194931057
        ],
        [
            33.66560388033668,
            18841.17408977919
        ],
        [
            33.70886732983662,
            17791.319755401397
        ],
        [
            33.79075885924721,
            15762.274359152003
        ],
        [
            33.834794870345355,
            14863.841323001772
        ],
        [
            33.881148566238146,
            13723.134209687438
        ],
        [
            33.957632164461245,
            10957.171828730556
        ],
        [
            34.01325659953259,
            9453.05359967006
        ],
        [
            34.04789835187476,
            9122.794464712295
        ],
        [
            34.11469708179134,
            8724.79713601049
        ],
        [
            34.1582355396834,
            8271.38245774261
        ],
        [
            34.182092228939325,
            8064.826882087242
        ],
        [
            34.21549159389762,
            7873.385129040804
        ],
        [
            34.26433911895186,
            7827.7983320275125
        ],
        [
            34.3137830612375,
            7726.850799875801
        ],
        [
            34.340739212491215,
            7681.943375994366
        ],
        [
            34.39262751162285,
            7838.119542953302
        ],
        [
            34.41111644579619,
            7999.333650781882
        ],
        [
            34.43258746612652,
            8457.786269919405
        ],
        [
            34.44434597133552,
            8726.231368177741
        ]
    ],
    "Line3": [
        [
            35.59517834199302,
            20521.579862296585
        ],
        [
            35.62172780282518,
            20407.110346722086
        ],
        [
            35.65017506085472,
            20301.87780918041
        ],
        [
            35.664130319510726,
            20148.812300028883
        ],
        [
            35.73873727924859,
            19048.653953002286
        ],
        [
            35.808513572528604,
            17862.39625707795
        ],
        [
            35.84018127486338,
            17087.50211699835
        ],
        [
            35.88553457785745,
            15382.832864118383
        ],
        [
            35.93733134473787,
            13107.798879058651
        ],
        [
            35.97329297281296,
            11624.976759153236
        ],
        [
            36.02217280649953,
            9888.872939798835
        ],
        [
            36.04951015470344,
            9453.35984806595
        ],
        [
            36.093597335107894,
            8965.319331831324
        ],
        [
            36.165021863716255,
            8325.936064776894
        ],
        [
            36.21053236996502,
            7836.605407652949
        ],
        [
            36.23790614655949,
            7654.84011553551
        ],
        [
            36.26689014530657,
            7693.106492823392
        ],
        [
            36.30875592127458,
            7903.571567906742
        ],
        [
            36.37463732811036,
            8207.53175606311
        ],
        [
            36.41664080549984,
            8544.53338747876
        ]
    ],
    "Line4": [
        [
            37.62002070211612,
            20078.295058937867
        ],
        [
            37.653948148219115,
            20052.18981728707
        ],
        [
            37.68184404834824,
            20108.12962082449
        ],
        [
            37.71652543769797,
            20231.197188606817
        ],
        [
            37.69616897003617,
            20201.36262672019
        ],
        [
            37.75120682704769,
            19843.3478840807
        ],
        [
            37.77307118120295,
            19686.716434175923
        ],
        [
            37.80322891107228,
            18918.476465595348
        ],
        [
            37.883754896146584,
            15489.267146684302
        ],
        [
            38.00832654886021,
            10730.742528327351
        ],
        [
            38.05735152186363,
            9644.229507645425
        ],
        [
            38.08451361975116,
            9312.314583940579
        ],
        [
            38.13048713732776,
            8839.405047881035
        ],
        [
            38.17983157903102,
            8394.618986165542
        ],
        [
            38.19317480772558,
            8326.329454781237
        ],
        [
            38.22371495484247,
            8175.424868575415
        ],
        [
            38.281580496748155,
            8034.580588116647
        ],
        [
            38.328998093587536,
            8125.12333984014
        ],
        [
            38.37802306659096,
            8306.208843287128
        ],
        [
            38.416600094528086,
            8517.47526397528
        ],
        [
            38.44710505279063,
            8876.305363278232
        ],
        [
            38.474263753018825,
            9588.438179653367
        ],
        [
            38.498356417830564,
            10624.494714695835
        ],
        [
            38.55958619541956,
            12777.000578491628
        ],
        [
            38.606200104176914,
            14406.370266414913
        ],
        [
            38.65602876526236,
            16542.654968358776
        ]
    ],
    "Line5": [
        [
            56.08349354908494,
            13962.18900616033
        ],
        [
            56.0989557285616,
            11898.326846354292
        ],
        [
            56.11139352989805,
            11092.587766554647
        ],
        [
            56.14711234399249,
            10122.038420432347
        ],
        [
            56.16169338924811,
            10101.886908469722
        ]
    ]
}