{
    "Line1": [
        [
            31.007863972957693,
            10670.073000769073
        ],
        [
            31.062972450809063,
            12951.609204366758
        ],
        [
            31.137368895908416,
            15430.31520333708
        ],
        [
            31.182361434898272,
            16602.45772036725
        ],
        [
            31.202324277430627,
            16767.979176601642
        ],
        [
            31.23931957993345,
            16810.503770945557
        ],
        [
            31.269629242751705,
            16782.336657320895
        ],
        [
            31.327493144495648,
            15740.153453208372
        ],
        [
            31.443220947983527,
            13007.943431616082
        ],
        [
            31.537949567505827,
            11471.292577100947
        ],
        [
            31.55916008769645,
            11335.865931090986
        ],
        [
            31.56914150896263,
            11305.77112086655
        ],
        [
            31.579122930228806,
            10959.680803285539
        ],
        [
            31.58785667383671,
            10899.491182836668
        ],
        [
            31.62154397061006,
            10779.111941938925
        ],
        [
            31.637763780167596,
            10703.874916377834
        ],
        [
            31.671451076940944,
            9274.371430717136
        ],
        [
            31.678937142890575,
            9259.324025604918
        ],
        [
            31.700147663081204,
            9199.134405156045
        ],
        [
            31.708881406689105,
            9169.03959493161
        ],
        [
            31.72884424922146,
            8672.47522622842
        ],
        [
            31.760036190678264,
            8386.574529096279
        ]
    ],
    "Line2": [
        [
            31.520482080290016,
            10779.111941938925
        ],
        [
            31.602828805735978,
            11681.956248671999
        ],
        [
            31.644002168458957,
            12584.800555405072
        ]
    ]
}