# pos,db_norm,db,t01,t02,t03,t12,t13,t23,h_db_norm,h_db,h_t01,h_t02,h_t03,h_t12,h_t13,h_t23
1.562500000000000033e-05,0.000000000000000000e+00,-5.317760620117187500e+02,0.000000000000000000e+00,0.000000000000000000e+00,0.000000000000000000e+00,0.000000000000000000e+00,0.000000000000000000e+00,0.000000000000000000e+00,-2.201597023010253906e+01,-5.537920532226562500e+02,-6.857103289803490138e-08,-2.668167326191906005e-08,-1.076139160431921420e-07,4.188935781712644072e-08,-3.904288314515724720e-08,-8.093224460026249575e-08
3.104734375000000046e+00,-1.150815606117248535e+00,-4.270463256835937500e+02,3.007812499999999961e-04,1.718749999999999900e-04,-2.031249999999999907e-04,-1.289062500000000061e-04,-5.039062500000000139e-04,-3.750000000000000078e-04,-1.010885620117187500e+01,-4.360043640136718750e+02,2.997652292251586710e-04,1.713653504848480227e-04,-2.030403017997741712e-04,-1.283998787403106755e-04,-5.028055310249328422e-04,-3.744056522846221668e-04
3.362222656250000163e+00,-1.797469258308410645e+00,-4.918203125000000000e+02,6.679687500000000512e-04,2.187500000000000046e-04,1.250000000000000026e-04,-4.492187500000000195e-04,-5.429687500000000486e-04,-9.375000000000000195e-05,-9.216070175170898438e+00,-4.992388916015625000e+02,6.662831306457519653e-04,2.166831791400909300e-04,1.236802265048027153e-04,-4.495999217033386144e-04,-5.426028966903686515e-04,-9.300295263528824178e-05
3.568597656250000139e+00,-3.669171571731567383e+00,-5.229315795898437500e+02,1.328125000000000095e-04,9.062500000000000460e-04,5.664062499999999610e-04,7.734375000000000364e-04,4.335937500000000056e-04,-3.398437499999999766e-04,-1.313650131225585938e+01,-5.323989257812500000e+02,1.339644491672515767e-04,9.061398506164551267e-04,5.664315819740295670e-04,7.721753716468810749e-04,4.324671030044555694e-04,-3.397082686424255597e-04
5.570828125000000242e+00,-2.731571674346923828e+00,-4.692735595703125000e+02,-2.773437499999999753e-04,1.367187500000000130e-04,-3.828125000000000147e-04,4.140624999999999883e-04,-1.054687499999999988e-04,-5.195312500000000278e-04,-7.876827716827392578e+00,-4.744187927246093750e+02,-2.769791483879089538e-04,1.391742527484893667e-04,-3.805427551269531441e-04,4.161534011363982933e-04,-1.035635918378829934e-04,-5.197169780731201441e-04
1.640687499999999943e+01,-5.530260086059570312e+00,-3.961880187988281250e+02,-1.796874999999999970e-04,-4.726562499999999861e-04,1.132812500000000057e-04,-2.929687499999999892e-04,2.929687499999999892e-04,5.859374999999999783e-04,-9.461526870727539062e+00,-4.001192932128906250e+02,-1.803933531045913755e-04,-4.724093973636627223e-04,1.130177676677703811e-04,-2.920160293579101771e-04,2.934111356735229670e-04,5.854271650314330899e-04
3.759246093750000028e+01,-2.125880241394042969e+00,-4.186881103515625000e+02,-2.500000000000000052e-04,2.382812499999999948e-04,7.421875000000000087e-04,4.882812500000000000e-04,9.921875000000000139e-04,5.039062500000000139e-04,-6.942294120788574219e+00,-4.235045166015625000e+02,-2.516823410987854273e-04,2.364443093538284304e-04,7.427960038185120158e-04,4.881266653537750274e-04,9.944783449172974431e-04,5.063516497611999677e-04
