# pos,db_norm,db,t01,t02,t03,t12,t13,t23,h_db_norm,h_db,h_t01,h_t02,h_t03,h_t12,h_t13,h_t23
1.171875000000000024e-05,0.000000000000000000e+00,-5.450277709960937500e+02,0.000000000000000000e+00,0.000000000000000000e+00,0.000000000000000000e+00,0.000000000000000000e+00,0.000000000000000000e+00,0.000000000000000000e+00,-2.216652679443359375e+01,-5.671942749023437500e+02,6.613233563257381066e-08,-6.632034910580841732e-09,-1.092081074602901959e-07,-7.276437099790200337e-08,-1.753404503688216222e-07,-1.025760720949620032e-07
5.537085937499999666e+00,-2.519405364990234375e+00,-5.240170898437500000e+02,-1.406249999999999894e-04,2.460937500000000017e-04,-3.320312500000000239e-04,3.867187500000000182e-04,-1.914062500000000074e-04,-5.781249999999999714e-04,-1.164264869689941406e+01,-5.331403198242187500e+02,-1.391784697771072444e-04,2.478294819593429609e-04,-3.310530483722686911e-04,3.870079517364502053e-04,-1.918745636940002498e-04,-5.788825154304504551e-04
5.599882812499999751e+00,-1.985400915145874023e+00,-5.192778930664062500e+02,-1.367187500000000130e-04,2.187500000000000046e-04,-3.281250000000000204e-04,3.554687499999999905e-04,-1.914062500000000074e-04,-5.468750000000000520e-04,-1.163442039489746094e+01,-5.289268798828125000e+02,-1.377854794263839782e-04,2.187556326389312610e-04,-3.286248743534088109e-04,3.565410971641540423e-04,-1.908393949270248326e-04,-5.473805069923401261e-04
5.659246093750000206e+00,-1.787170767784118652e+00,-5.012777709960937500e+02,-1.367187500000000130e-04,2.187500000000000046e-04,-3.593749999999999939e-04,3.554687499999999905e-04,-2.226562500000000080e-04,-5.781249999999999714e-04,-1.118779277801513672e+01,-5.106783752441406250e+02,-1.370026469230651938e-04,2.194069027900695686e-04,-3.584108650684356460e-04,3.564095497131347895e-04,-2.214082032442092824e-04,-5.778177380561829021e-04
5.717117187500000419e+00,-2.663081645965576172e+00,-4.884883117675781250e+02,-1.367187500000000130e-04,2.187500000000000046e-04,-3.593749999999999939e-04,3.554687499999999905e-04,-2.226562500000000080e-04,-5.781249999999999714e-04,-1.121599578857421875e+01,-4.970412597656250000e+02,-1.357565224170684866e-04,2.205076515674591069e-04,-3.577947318553924608e-04,3.562641739845275935e-04,-2.220381945371627773e-04,-5.783023834228515677e-04
5.771816406250000142e+00,-2.110387563705444336e+00,-4.724388427734375000e+02,-1.328125000000000095e-04,2.226562500000000080e-04,-3.554687499999999905e-04,3.554687499999999905e-04,-2.226562500000000080e-04,-5.781249999999999714e-04,-9.997791290283203125e+00,-4.803262329101562500e+02,-1.339579820632934575e-04,2.223648279905319190e-04,-3.563553094863891385e-04,3.563228249549865462e-04,-2.223973274230957081e-04,-5.787201523780822815e-04
5.830652343749999744e+00,-2.984758615493774414e+00,-4.783315429687500000e+02,-1.328125000000000095e-04,2.226562500000000080e-04,-3.554687499999999905e-04,3.554687499999999905e-04,-2.226562500000000080e-04,-5.781249999999999714e-04,-1.003181362152099609e+01,-4.853785705566406250e+02,-1.341192722320556723e-04,2.220890671014785832e-04,-3.567932546138763666e-04,3.562083244323730586e-04,-2.226739972829818641e-04,-5.788823366165160925e-04
6.084527343749999595e+00,-1.040799140930175781e+00,-4.626452026367187500e+02,-1.250000000000000026e-04,2.265625000000000115e-04,-3.554687499999999905e-04,3.515624999999999870e-04,-2.304687499999999879e-04,-5.820312499999999748e-04,-1.029524707794189453e+01,-4.718996582031250000e+02,-1.235396936535835307e-04,2.281139492988586539e-04,-3.532002866268157807e-04,3.516536355018615861e-04,-2.296605855226516787e-04,-5.813142657279967741e-04
6.159851562500000099e+00,-3.292209625244140625e+00,-4.638709716796875000e+02,-8.593750000000000043e-04,-5.078125000000000173e-04,-1.089843750000000101e-03,3.515624999999999870e-04,-2.304687499999999879e-04,-5.820312499999999748e-04,-1.450806140899658203e+01,-4.750868225097656250e+02,-8.594542741775512695e-04,-5.076627135276794113e-04,-1.089063405990600654e-03,3.517915308475494645e-04,-2.296090871095657392e-04,-5.814006328582763464e-04
6.230843750000000014e+00,-1.549179434776306152e+00,-4.560581970214843750e+02,-1.250000000000000026e-04,2.265625000000000115e-04,-3.554687499999999905e-04,3.515624999999999870e-04,-2.304687499999999879e-04,-5.820312499999999748e-04,-1.218505001068115234e+01,-4.666940612792968750e+02,-1.238336786627769416e-04,2.278674393892288100e-04,-3.531306087970733569e-04,3.517011106014251531e-04,-2.292969375848770137e-04,-5.809980630874634179e-04
6.272472656249999723e+00,-1.801902770996093750e+00,-5.141791992187500000e+02,-1.250000000000000026e-04,2.265625000000000115e-04,-3.554687499999999905e-04,3.515624999999999870e-04,-2.304687499999999879e-04,-5.820312499999999748e-04,-1.075979328155517578e+01,-5.231371459960937500e+02,-1.238201782107353299e-04,2.275207340717315591e-04,-3.542128205299377398e-04,3.513409197330474875e-04,-2.303926497697830083e-04,-5.817335844039917469e-04
6.299980468750000284e+00,-1.830539584159851074e+00,-4.376240844726562500e+02,-1.484374999999999963e-04,2.031249999999999907e-04,-3.789062500000000113e-04,3.515624999999999870e-04,-2.304687499999999879e-04,-5.820312499999999748e-04,-1.103316783905029297e+01,-4.468267517089843750e+02,-1.497524827718734613e-04,2.005637437105178768e-04,-3.799603879451751579e-04,3.503162264823913652e-04,-2.302078902721404997e-04,-5.805241465568542316e-04
6.334429687500000128e+00,-1.647167444229125977e+00,-4.939111938476562500e+02,-1.601562500000000067e-04,1.914062500000000074e-04,-3.906250000000000217e-04,3.515624999999999870e-04,-2.304687499999999879e-04,-5.820312499999999748e-04,-9.131353378295898438e+00,-5.013953857421875000e+02,-1.583773642778396552e-04,1.933274269104003963e-04,-3.872330486774444645e-04,3.517047762870788817e-04,-2.288556993007659791e-04,-5.805605053901672545e-04
6.363382812500000263e+00,-1.348682880401611328e+00,-4.521096191406250000e+02,-1.289062500000000061e-04,2.226562500000000080e-04,-3.593749999999999939e-04,3.515624999999999870e-04,-2.304687499999999879e-04,-5.820312499999999748e-04,-1.166188812255859375e+01,-4.624227905273437500e+02,-1.298313140869140675e-04,2.203675955533981412e-04,-3.606107532978057844e-04,3.501989245414734056e-04,-2.307794243097305200e-04,-5.809783339500427558e-04
6.425210937500000163e+00,-1.237468957901000977e+00,-4.421121215820312500e+02,-1.289062500000000061e-04,2.226562500000000080e-04,-3.593749999999999939e-04,3.515624999999999870e-04,-2.304687499999999879e-04,-5.820312499999999748e-04,-1.119694900512695312e+01,-4.520715637207031250e+02,-1.263270825147628704e-04,2.238421440124511639e-04,-3.575149774551391463e-04,3.501692116260528374e-04,-2.311879098415374728e-04,-5.813571214675903372e-04
6.487199218749999829e+00,-5.815320014953613281e-01,-4.460308532714843750e+02,-1.289062500000000061e-04,2.226562500000000080e-04,-3.593749999999999939e-04,3.515624999999999870e-04,-2.304687499999999879e-04,-5.820312499999999748e-04,-1.070348644256591797e+01,-4.561527709960937500e+02,-1.265384256839752251e-04,2.243835926055908294e-04,-3.572288453578949209e-04,3.509220182895660275e-04,-2.306904196739196686e-04,-5.816124677658080899e-04
6.548804687499999666e+00,-1.314337372779846191e+00,-4.465749511718750000e+02,-1.250000000000000026e-04,2.265625000000000115e-04,-3.554687499999999905e-04,3.515624999999999870e-04,-2.304687499999999879e-04,-5.820312499999999748e-04,-1.135197830200195312e+01,-4.566125488281250000e+02,-1.260947287082672197e-04,2.240688055753707977e-04,-3.567012548446655109e-04,3.501635193824768205e-04,-2.306065112352371214e-04,-5.807700753211975054e-04
6.617230468749999872e+00,0.000000000000000000e+00,-4.379875183105468750e+02,-1.289062500000000061e-04,2.226562500000000080e-04,-3.593749999999999939e-04,3.515624999999999870e-04,-2.304687499999999879e-04,-5.820312499999999748e-04,-1.068633079528808594e+01,-4.486738586425781250e+02,-1.274672746658325089e-04,2.230559885501861520e-04,-3.583393692970275818e-04,3.505232632160186880e-04,-2.308720946311950729e-04,-5.813953876495361276e-04
6.682121093750000185e+00,0.000000000000000000e+00,-4.260938110351562500e+02,-1.289062500000000061e-04,2.226562500000000080e-04,-3.593749999999999939e-04,3.515624999999999870e-04,-2.304687499999999879e-04,-5.820312499999999748e-04,-9.707734107971191406e+00,-4.358015441894531250e+02,-1.280008256435394255e-04,2.224733531475067032e-04,-3.594379723072051755e-04,3.504741787910461287e-04,-2.314371615648269740e-04,-5.819113254547119600e-04
6.748554687500000426e+00,-1.214867010712623596e-01,-4.297203979492187500e+02,-1.289062500000000061e-04,2.226562500000000080e-04,-3.593749999999999939e-04,3.515624999999999870e-04,-2.304687499999999879e-04,-5.820312499999999748e-04,-9.228297233581542969e+00,-4.388271789550781250e+02,-1.286132186651229789e-04,2.215554416179657093e-04,-3.602899014949798679e-04,3.501686453819274642e-04,-2.316766977310180588e-04,-5.818453431129456043e-04
6.820621093749999808e+00,-2.759068965911865234e+00,-4.446685180664062500e+02,-1.289062500000000061e-04,2.187500000000000046e-04,-3.632812499999999974e-04,3.476562499999999835e-04,-2.343749999999999913e-04,-5.820312499999999748e-04,-1.086423015594482422e+01,-4.527736816406250000e+02,-1.286612004041671857e-04,2.197674512863159052e-04,-3.620587289333343289e-04,3.484286367893219211e-04,-2.333975285291671703e-04,-5.818262100219727092e-04
7.035781250000000320e+00,-1.128062844276428223e+00,-4.770009155273437500e+02,-1.289062500000000061e-04,2.187500000000000046e-04,-3.593749999999999939e-04,3.476562499999999835e-04,-2.304687499999999879e-04,-5.781249999999999714e-04,-9.320480346679687500e+00,-4.851933593750000000e+02,-1.287251710891723687e-04,2.196708172559738216e-04,-3.597466349601745350e-04,3.483960032463073600e-04,-2.310214638710021934e-04,-5.794174671173096076e-04
7.109195312499999808e+00,-1.247139453887939453e+00,-4.665167846679687500e+02,-1.562500000000000033e-04,1.914062500000000074e-04,-3.906250000000000217e-04,3.476562499999999835e-04,-2.343749999999999913e-04,-5.820312499999999748e-04,-9.424617767333984375e+00,-4.746942749023437500e+02,-1.561511754989624115e-04,1.918683201074600296e-04,-3.895420432090759030e-04,3.480195105075836108e-04,-2.333908677101135187e-04,-5.814103484153747628e-04
7.181699218750000391e+00,-1.321334838867187500e+00,-4.774485473632812500e+02,-1.562500000000000033e-04,1.914062500000000074e-04,-3.906250000000000217e-04,3.476562499999999835e-04,-2.343749999999999913e-04,-5.820312499999999748e-04,-8.920166969299316406e+00,-4.850473632812500000e+02,-1.559235602617263668e-04,1.919048726558685307e-04,-3.893332779407501212e-04,3.478284478187560944e-04,-2.334097176790237544e-04,-5.812381505966187061e-04
7.505320312500000313e+00,-5.454267501831054688e+00,-4.937353515625000000e+02,-1.054687499999999988e-04,1.757812499999999935e-04,7.421875000000000087e-04,2.812499999999999787e-04,8.476562499999999939e-04,5.664062499999999610e-04,-1.222662162780761719e+01,-5.005077514648437500e+02,-1.045961007475852954e-04,1.749133765697479155e-04,7.411705255508422999e-04,2.795094847679137958e-04,8.457666039466858136e-04,5.662571191787720178e-04
7.965652343750000419e+00,0.000000000000000000e+00,-4.954098815917968750e+02,-1.132812500000000057e-04,2.421874999999999983e-04,-3.398437499999999766e-04,3.554687499999999905e-04,-2.265625000000000115e-04,-5.820312499999999748e-04,-8.201507568359375000e+00,-5.036114196777343750e+02,-1.135066151618957547e-04,2.416630387306213375e-04,-3.402090668678283943e-04,3.551696538925170786e-04,-2.267024517059326261e-04,-5.818721055984496775e-04
8.194183593749999162e+00,-4.164633274078369141e+00,-4.322957153320312500e+02,1.484374999999999963e-04,4.335937500000000056e-04,-1.484374999999999963e-04,2.851562499999999822e-04,-2.968749999999999926e-04,-5.820312499999999748e-04,-1.710632896423339844e+01,-4.452374267578125000e+02,1.483703404664993308e-04,4.341305792331695318e-04,-1.479772031307220509e-04,2.857602536678313979e-04,-2.963475286960601577e-04,-5.821077823638915556e-04
8.528093750000000028e+00,-1.062713527679443359e+01,-4.597583007812500000e+02,-1.066406250000000080e-03,-8.945312500000000356e-04,-3.515624999999999734e-05,1.718749999999999900e-04,1.031250000000000049e-03,8.593750000000000043e-04,-1.864970588684082031e+01,-4.677808837890625000e+02,-1.064935326576232997e-03,-8.932424783706664675e-04,-3.417224436998367109e-05,1.716928780078887877e-04,1.030763149261474569e-03,8.590701818466186818e-04
1.329801953125000047e+01,-4.351747035980224609e+00,-4.949683837890625000e+02,7.890625000000000503e-04,1.058593750000000073e-03,5.351562500000000416e-04,2.695312500000000226e-04,-2.539062500000000087e-04,-5.234375000000000312e-04,-1.144794464111328125e+01,-5.020645751953125000e+02,7.882734537124633581e-04,1.057041645050048849e-03,5.346402525901794217e-04,2.687681615352630429e-04,-2.536332309246063302e-04,-5.224013924598694273e-04
1.390076171874999922e+01,-6.753590106964111328e+00,-5.260526733398437500e+02,-1.210937499999999991e-04,1.757812499999999935e-04,-4.062499999999999814e-04,2.968749999999999926e-04,-2.851562499999999822e-04,-5.820312499999999748e-04,-1.758605575561523438e+01,-5.368851318359375000e+02,-1.217635348439216668e-04,1.756896525621414265e-04,-4.068581759929657113e-04,2.974531948566436646e-04,-2.850946187973022491e-04,-5.825477838516235742e-04
1.437191796874999916e+01,-4.878625392913818359e+00,-5.101892089843750000e+02,-8.515624999999999974e-04,-5.468750000000000520e-04,-3.085937500000000030e-04,3.046874999999999996e-04,5.429687500000000486e-04,2.382812499999999948e-04,-1.447281265258789062e+01,-5.197833862304687500e+02,-8.524353504180908316e-04,-5.482654571533203359e-04,-3.089258372783660928e-04,3.041698634624481019e-04,5.435094833374022908e-04,2.393396198749542160e-04
1.595633593750000045e+01,-3.102711141109466553e-01,-4.549771728515625000e+02,-9.765625000000000542e-05,2.031249999999999907e-04,-3.789062500000000113e-04,3.007812499999999961e-04,-2.812499999999999787e-04,-5.820312499999999748e-04,-1.021566200256347656e+01,-4.648825378417968750e+02,-9.643511474132537603e-05,2.046574950218200733e-04,-3.783087730407714753e-04,3.010925948619842525e-04,-2.818736732006073232e-04,-5.829662680625915215e-04
1.665969531249999847e+01,-2.003062248229980469e+00,-4.808365173339843750e+02,-1.015624999999999953e-04,1.992187499999999872e-04,-3.828125000000000147e-04,3.007812499999999961e-04,-2.812499999999999787e-04,-5.820312499999999748e-04,-1.171496582031250000e+01,-4.905484313964843750e+02,-1.014278382062912037e-04,1.980308294296264618e-04,-3.835635185241699041e-04,2.994586527347564957e-04,-2.821356654167175306e-04,-5.815943479537963659e-04
1.738985937500000034e+01,-3.126783967018127441e-01,-4.605628051757812500e+02,-1.093750000000000023e-04,1.992187499999999872e-04,-3.828125000000000147e-04,3.085937500000000030e-04,-2.734375000000000260e-04,-5.820312499999999748e-04,-1.108625793457031250e+01,-4.713363952636718750e+02,-1.083899438381195126e-04,2.001439779996871872e-04,-3.808887600898742498e-04,3.085339069366455165e-04,-2.724988162517547508e-04,-5.810327529907226068e-04
2.306655859374999906e+01,0.000000000000000000e+00,-5.032083740234375000e+02,-1.171874999999999957e-04,1.484374999999999963e-04,3.710937500000000043e-04,2.656250000000000191e-04,4.882812500000000000e-04,2.226562500000000080e-04,-1.074674415588378906e+01,-5.139551391601562500e+02,-1.174876466393470710e-04,1.480414271354675267e-04,3.713385462760925319e-04,2.655290663242339992e-04,4.888262152671813982e-04,2.232971340417862021e-04
2.337476171875000119e+01,-5.809068083763122559e-01,-4.572645263671875000e+02,-9.765625000000000542e-05,1.718749999999999900e-04,4.062499999999999814e-04,2.695312500000000226e-04,5.039062500000000139e-04,2.343749999999999913e-04,-1.039225196838378906e+01,-4.670758666992187500e+02,-9.663387387990951061e-05,1.718382090330123930e-04,4.076700806617737064e-04,2.684720754623413051e-04,5.043039321899414488e-04,2.358318716287612863e-04
2.364273046874999906e+01,-1.291116714477539062e+00,-4.947721862792968750e+02,-8.203125000000000510e-05,1.875000000000000039e-04,-3.906250000000000217e-04,2.695312500000000226e-04,-3.085937500000000030e-04,-5.781249999999999714e-04,-1.236199855804443359e+01,-5.058430480957031250e+02,-8.347423374652862365e-05,1.865215599536895752e-04,-3.915310800075530754e-04,2.699957787990570155e-04,-3.080568611621856893e-04,-5.780526399612426506e-04
2.386963671875000159e+01,0.000000000000000000e+00,-4.850241699218750000e+02,-8.203125000000000510e-05,1.914062500000000074e-04,4.765624999999999896e-04,2.734375000000000260e-04,5.585937499999999540e-04,2.851562499999999822e-04,-1.110673046112060547e+01,-4.961309204101562500e+02,-8.124145120382308711e-05,1.918080747127533085e-04,4.761936068534851330e-04,2.730495333671570076e-04,5.574350357055664383e-04,2.843855023384094308e-04
2.448486718750000080e+01,-2.114691972732543945e+00,-4.691756896972656250e+02,-8.203125000000000510e-05,1.953125000000000108e-04,-3.828125000000000147e-04,2.773437499999999753e-04,-3.007812499999999961e-04,-5.781249999999999714e-04,-1.355385780334472656e+01,-4.806148681640625000e+02,-8.169753849506378033e-05,1.958493292331695641e-04,-3.834604024887085043e-04,2.775468826293945278e-04,-3.017628490924835136e-04,-5.793097019195556476e-04
2.461245703124999906e+01,-4.730165600776672363e-01,-4.143040161132812500e+02,-1.796874999999999970e-04,2.070312499999999941e-04,-3.671875000000000009e-04,3.867187500000000182e-04,-1.875000000000000039e-04,-5.742187499999999679e-04,-9.454802513122558594e+00,-4.232857971191406250e+02,-1.812997013330459460e-04,2.047771066427230891e-04,-3.701267838478088448e-04,3.860768079757690352e-04,-1.888270974159240686e-04,-5.749039053916931308e-04
2.472972656250000156e+01,-7.409862279891967773e-01,-4.266375427246093750e+02,-1.796874999999999970e-04,2.070312499999999941e-04,-3.671875000000000009e-04,3.867187500000000182e-04,-1.875000000000000039e-04,-5.742187499999999679e-04,-9.902164459228515625e+00,-4.357986755371093750e+02,-1.809193193912506234e-04,2.064144760370254514e-04,-3.686454594135284515e-04,3.873338103294372446e-04,-1.877261400222778281e-04,-5.750599503517151269e-04
2.486324218749999915e+01,-7.910161614418029785e-01,-4.774708251953125000e+02,-8.593749999999999501e-05,1.914062500000000074e-04,-3.867187500000000182e-04,2.773437499999999753e-04,-3.007812499999999961e-04,-5.781249999999999714e-04,-9.772681236267089844e+00,-4.864524841308593750e+02,-8.752589672803878817e-05,1.897646635770797673e-04,-3.891661167144775269e-04,2.772905528545379435e-04,-3.016402423381805476e-04,-5.789307951927184911e-04
2.487133593749999960e+01,0.000000000000000000e+00,-4.160834960937500000e+02,-1.601562500000000067e-04,2.265625000000000115e-04,-3.476562499999999835e-04,3.867187500000000182e-04,-1.875000000000000039e-04,-5.742187499999999679e-04,-8.757725715637207031e+00,-4.248412475585937500e+02,-1.607183516025543243e-04,2.254946678876876937e-04,-3.484420776367187452e-04,3.862130343914031878e-04,-1.877237260341644209e-04,-5.739367604255676087e-04
2.502945703125000065e+01,-1.011795401573181152e+00,-4.326546630859375000e+02,-1.562500000000000033e-04,2.265625000000000115e-04,-3.476562499999999835e-04,3.828125000000000147e-04,-1.914062500000000074e-04,-5.742187499999999679e-04,-9.718026161193847656e+00,-4.413608398437500000e+02,-1.588375568389892496e-04,2.250478714704513600e-04,-3.487904369831085248e-04,3.838854134082794398e-04,-1.899528801441192753e-04,-5.738382935523986608e-04
2.519031250000000099e+01,-1.068419694900512695e+00,-4.862149658203125000e+02,-1.093750000000000023e-04,1.640625000000000102e-04,-4.140624999999999883e-04,2.734375000000000260e-04,-3.046874999999999996e-04,-5.781249999999999714e-04,-1.271216392517089844e+01,-4.978587341308593750e+02,-1.093226298689842213e-04,1.643259078264236504e-04,-4.139833748340606919e-04,2.736485302448272462e-04,-3.046607375144958722e-04,-5.783092975616455121e-04
2.520212499999999878e+01,0.000000000000000000e+00,-4.329864501953125000e+02,-1.562500000000000033e-04,2.265625000000000115e-04,-3.476562499999999835e-04,3.828125000000000147e-04,-1.914062500000000074e-04,-5.742187499999999679e-04,-1.065847206115722656e+01,-4.436448974609375000e+02,-1.555081307888031030e-04,2.272548377513885544e-04,-3.470523059368133554e-04,3.827629685401916573e-04,-1.915441751480102524e-04,-5.743071436882018826e-04
2.538955078125000142e+01,-5.894484519958496094e-01,-4.587859497070312500e+02,-1.562500000000000033e-04,2.265625000000000115e-04,-3.476562499999999835e-04,3.828125000000000147e-04,-1.914062500000000074e-04,-5.742187499999999679e-04,-9.324008941650390625e+00,-4.675204772949218750e+02,-1.583766192197799737e-04,2.235119044780731082e-04,-3.493261933326720923e-04,3.818885087966918850e-04,-1.909495890140533426e-04,-5.728380680084228880e-04
2.549506640625000031e+01,0.000000000000000000e+00,-4.960776977539062500e+02,-1.250000000000000026e-04,1.484374999999999963e-04,-4.179687499999999918e-04,2.734375000000000260e-04,-2.929687499999999892e-04,-5.664062499999999610e-04,-1.420783615112304688e+01,-5.102855224609375000e+02,-1.251441091299057074e-04,1.479788720607757495e-04,-4.183559119701385411e-04,2.731229662895202871e-04,-2.932118177413940577e-04,-5.663347840309143448e-04
2.585086718750000045e+01,-6.115686297416687012e-01,-4.629324951171875000e+02,-1.328125000000000095e-04,1.406249999999999894e-04,-4.257812499999999987e-04,2.734375000000000260e-04,-2.929687499999999892e-04,-5.664062499999999610e-04,-1.289542675018310547e+01,-4.752163696289062500e+02,-1.326608359813690298e-04,1.402778625488281374e-04,-4.248082041740417576e-04,2.729386985301971401e-04,-2.921473681926727278e-04,-5.650860667228698678e-04
2.613834765625000145e+01,0.000000000000000000e+00,-4.521679077148437500e+02,-1.953125000000000108e-04,1.875000000000000039e-04,-3.828125000000000147e-04,3.828125000000000147e-04,-1.875000000000000039e-04,-5.703124999999999644e-04,-7.727634429931640625e+00,-4.598955078125000000e+02,-1.939003169536590620e-04,1.881905794143676669e-04,-3.825148344039916784e-04,3.820908963680267559e-04,-1.886145174503326436e-04,-5.707054138183593724e-04
2.618296093749999898e+01,-2.094731092453002930e+00,-4.496508789062500000e+02,-1.562500000000000033e-04,1.171874999999999957e-04,-4.453125000000000160e-04,2.734375000000000260e-04,-2.890624999999999857e-04,-5.624999999999999575e-04,-1.326954460144042969e+01,-4.608256835937500000e+02,-1.582536548376083368e-04,1.162086501717567475e-04,-4.477227032184600869e-04,2.744623124599456692e-04,-2.894690334796905262e-04,-5.639313459396362496e-04
2.620958593750000176e+01,-3.304929137229919434e-01,-4.607621765136718750e+02,-1.914062500000000074e-04,1.914062500000000074e-04,-3.789062500000000113e-04,3.828125000000000147e-04,-1.875000000000000039e-04,-5.703124999999999644e-04,-7.900660514831542969e+00,-4.683323364257812500e+02,-1.929878741502761858e-04,1.893673837184905941e-04,-3.812299668788909890e-04,3.823552727699279768e-04,-1.882420778274536063e-04,-5.705973505973815831e-04
4.632867968749999932e+01,-2.727750301361083984e+00,-3.275709228515625000e+02,-4.960937500000000069e-04,-4.218749999999999952e-04,-1.210937499999999991e-04,7.421874999999999816e-05,3.750000000000000078e-04,3.007812499999999961e-04,-8.753447532653808594e+00,-3.335966186523437500e+02,-4.941797554492949980e-04,-4.211198091506957917e-04,-1.215601414442062366e-04,7.305993884801864852e-05,3.726196289062500260e-04,2.995596826076507655e-04
5.014467187500000023e+01,-9.482589960098266602e-01,-3.423010253906250000e+02,-5.546874999999999506e-04,-1.328125000000000095e-04,-2.148437500000000011e-04,4.218749999999999952e-04,3.398437499999999766e-04,-8.203125000000000510e-05,-8.958016395568847656e+00,-3.503107910156250000e+02,-5.555971860885619996e-04,-1.331233233213424563e-04,-2.154031693935394218e-04,4.224738478660583735e-04,3.401939868927001840e-04,-8.227983862161636699e-05
5.014721093749999881e+01,-9.685078859329223633e-01,-3.422451477050781250e+02,-5.546874999999999506e-04,-1.328125000000000095e-04,-2.148437500000000011e-04,4.218749999999999952e-04,3.398437499999999766e-04,-8.203125000000000510e-05,-8.948485374450683594e+00,-3.502250976562500000e+02,-5.555982589721679583e-04,-1.331218034029006995e-04,-2.154014557600021325e-04,4.224764704704284828e-04,3.401968181133270498e-04,-8.227965235710144661e-05
5.148418359374999653e+01,-3.481894016265869141e+00,-4.669906616210937500e+02,-2.734375000000000260e-04,-3.398437499999999766e-04,1.718749999999999900e-04,-6.640625000000000477e-05,4.453125000000000160e-04,5.117187500000000208e-04,-8.906841278076171875e+00,-4.724156188964843750e+02,-2.746044397354125951e-04,-3.408890068531036238e-04,1.707020699977874665e-04,-6.628455221652984543e-05,4.453065097332000615e-04,5.115910768508911445e-04
