# pos,db_norm,db,t01,t02,t03,t12,t13,t23,h_db_norm,h_db,h_t01,h_t02,h_t03,h_t12,h_t13,h_t23
2.544531250000000092e-02,-2.497559070587158203e+00,-3.344627075195312500e+02,-3.085937500000000030e-04,-7.812500000000000163e-05,2.773437499999999753e-04,2.304687499999999879e-04,5.859374999999999783e-04,3.554687499999999905e-04,-1.064427375793457031e+01,-3.426094055175781250e+02,-3.112096488475799482e-04,-7.835344970226288200e-05,2.758759558200836416e-04,2.328561842441558829e-04,5.870856046676635898e-04,3.542294204235077069e-04
1.100703125000000032e-01,-1.628015756607055664e+00,-2.579495849609375000e+02,3.750000000000000078e-04,-1.406249999999999894e-04,-1.367187500000000130e-04,-5.156250000000000243e-04,-5.117187500000000208e-04,3.906250000000000081e-06,-1.173052692413330078e+01,-2.680520935058593750e+02,3.759949803352356161e-04,-1.400668472051620598e-04,-1.372964084148407056e-04,-5.160618424415588457e-04,-5.132914185523987155e-04,2.770443912595510564e-06
1.592148437500000013e-01,-2.572875022888183594e+00,-3.304098510742187500e+02,8.203125000000000510e-05,3.203125000000000134e-04,6.718749999999999462e-04,2.382812499999999948e-04,5.898437499999999818e-04,3.515624999999999870e-04,-1.074187278747558594e+01,-3.385788574218750000e+02,8.298368752002715772e-05,3.201510012149810964e-04,6.716470122337341421e-04,2.371673136949539252e-04,5.886633396148681406e-04,3.514960110187530457e-04
2.979960937500000240e-01,-8.493375182151794434e-01,-3.358607788085937500e+02,8.984374999999999848e-05,3.242187500000000169e-04,6.757812499999999497e-04,2.343749999999999913e-04,5.859374999999999783e-04,3.515624999999999870e-04,-9.810390472412109375e+00,-3.448218383789062500e+02,8.838088810443877610e-05,3.229205608367919701e-04,6.753241419792174868e-04,2.345396578311920242e-04,5.869432687759399076e-04,3.524035811424255167e-04
3.386058593750000068e+00,-1.003425407409667969e+01,-3.714648742675781250e+02,-4.179687499999999918e-04,-7.421874999999999816e-05,5.664062499999999610e-04,3.437499999999999801e-04,9.843750000000000069e-04,6.406250000000000269e-04,-1.770730209350585938e+01,-3.791379089355468750e+02,-4.187920391559600748e-04,-7.442133873701095928e-05,5.662122964859008997e-04,3.443706929683685442e-04,9.850043058395386349e-04,6.406336426734924845e-04
4.125671875000000099e+00,-8.154729843139648438e+00,-4.193498535156250000e+02,-3.554687499999999905e-04,-9.296874999999999584e-04,-6.015624999999999922e-04,-5.742187499999999679e-04,-2.460937500000000017e-04,3.281250000000000204e-04,-1.630775833129882812e+01,-4.275028991699218750e+02,-3.545951247215270810e-04,-9.298018217086792461e-04,-6.018515229225158709e-04,-5.752066969871521109e-04,-2.472564131021499868e-04,3.279502689838409272e-04
7.777558593750000249e+00,-8.096193313598632812e+00,-4.122946166992187500e+02,5.000000000000000104e-04,6.953124999999999670e-04,-3.046874999999999996e-04,1.953125000000000108e-04,-8.046874999999999558e-04,-1.000000000000000021e-03,-1.809727096557617188e+01,-4.222956848144531250e+02,5.010909438133239781e-04,6.950072050094604527e-04,-3.053855001926422197e-04,1.939162611961364746e-04,-8.064764142036438040e-04,-1.000392675399780279e-03
8.006921874999999744e+00,-9.388147354125976562e+00,-4.208533935546875000e+02,-4.101562499999999848e-04,-2.890624999999999857e-04,-7.500000000000000156e-04,1.210937499999999991e-04,-3.398437499999999766e-04,-4.609374999999999757e-04,-1.733565139770507812e+01,-4.288009033203125000e+02,-4.091540873050689966e-04,-2.888786196708679034e-04,-7.499683499336242320e-04,1.202754601836204541e-04,-3.408142626285552896e-04,-4.610897004604339348e-04
1.154415625000000034e+01,-2.908159494400024414e+00,-3.415002136230468750e+02,3.476562499999999835e-04,0.000000000000000000e+00,-2.773437499999999753e-04,-3.476562499999999835e-04,-6.250000000000000130e-04,-2.773437499999999753e-04,-1.434973526000976562e+01,-3.529417724609375000e+02,3.473140895366668606e-04,1.129989032051525945e-07,-2.766922116279602051e-04,-3.472010791301727360e-04,-6.240062713623046719e-04,-2.768052220344543297e-04
1.166002343749999959e+01,-4.826338768005371094e+00,-3.437008056640625000e+02,3.632812499999999974e-04,7.812500000000000163e-05,-1.992187499999999872e-04,-2.851562499999999822e-04,-5.624999999999999575e-04,-2.773437499999999753e-04,-1.308208656311035156e+01,-3.519565124511718750e+02,3.649222552776336674e-04,7.930631935596466292e-05,-1.986432969570159997e-04,-2.856159210205078212e-04,-5.635655522346496400e-04,-2.779496014118194793e-04
1.189954687500000041e+01,-2.645100951194763184e-01,-2.974077758789062500e+02,-2.460937500000000017e-04,-7.812500000000000163e-05,3.320312500000000239e-04,1.679687499999999866e-04,5.781249999999999714e-04,4.101562499999999848e-04,-7.374592781066894531e+00,-3.045178527832031250e+02,-2.433792799711227304e-04,-7.623343169689178922e-05,3.348720371723175261e-04,1.671458482742309683e-04,5.782513022422790597e-04,4.111054837703704851e-04
1.206512890624999912e+01,-2.140572309494018555e+00,-2.503542938232421875e+02,-2.031249999999999907e-04,-7.812500000000000163e-05,3.789062500000000113e-04,1.250000000000000026e-04,5.820312499999999748e-04,4.570312500000000265e-04,-1.405365085601806641e+01,-2.622673645019531250e+02,-2.038570642471313474e-04,-7.849016040563583851e-05,3.772580325603485133e-04,1.253669112920761074e-04,5.811150670051574941e-04,4.557481706142425294e-04
1.218669140625000047e+01,0.000000000000000000e+00,-2.215257110595703125e+02,2.109374999999999976e-04,-3.164062500000000100e-04,1.718749999999999900e-04,-5.273437500000000347e-04,-3.906250000000000081e-05,4.882812500000000000e-04,-8.977104187011718750e+00,-2.305028076171875000e+02,2.108813524246215792e-04,-3.155860006809234407e-04,1.728063672780990592e-04,-5.264673233032227074e-04,-3.807498514652252002e-05,4.883923530578613030e-04
1.223066015624999991e+01,-2.290812730789184570e+00,-2.623946228027343750e+02,-2.460937500000000017e-04,-7.812500000000000163e-05,3.320312500000000239e-04,1.679687499999999866e-04,5.781249999999999714e-04,4.101562499999999848e-04,-7.906637191772460938e+00,-2.680104370117187500e+02,-2.445889115333556968e-04,-7.732111960649490194e-05,3.337406218051910630e-04,1.672677993774414069e-04,5.783295631408691536e-04,4.110617339611053259e-04
1.233796874999999993e+01,-3.778377175331115723e-01,-1.723682556152343750e+02,2.148437500000000011e-04,-3.125000000000000065e-04,1.757812499999999935e-04,-5.273437500000000347e-04,-3.906250000000000081e-05,4.882812500000000000e-04,-1.092987823486328125e+01,-1.829202880859375000e+02,2.136406898498535050e-04,-3.131906092166900904e-04,1.741033345460891784e-04,-5.268313288688660162e-04,-3.953735530376434012e-05,4.872939586639404115e-04
1.236638671875000028e+01,-7.888767719268798828e-01,-2.722397155761718750e+02,-2.070312499999999941e-04,-4.296874999999999751e-05,3.710937500000000043e-04,1.640625000000000102e-04,5.781249999999999714e-04,4.140624999999999883e-04,-7.688668251037597656e+00,-2.791395263671875000e+02,-2.077476978302001884e-04,-4.307691007852554619e-05,3.697678744792938402e-04,1.646707952022552609e-04,5.775156021118163681e-04,4.128447771072387947e-04
1.249772656250000047e+01,-1.666430354118347168e+00,-2.768620605468750000e+02,-2.851562499999999822e-04,-1.250000000000000026e-04,2.890624999999999857e-04,1.601562500000000067e-04,5.742187499999999679e-04,4.140624999999999883e-04,-8.805801391601562500e+00,-2.840014343261718750e+02,-2.848677039146423496e-04,-1.245801672339439271e-04,2.904462218284606877e-04,1.602875292301177970e-04,5.753139257431029831e-04,4.150263965129852403e-04
1.256219531250000010e+01,-4.932207986712455750e-02,-1.562297668457031250e+02,2.187500000000000046e-04,-3.125000000000000065e-04,1.718749999999999900e-04,-5.312500000000000382e-04,-4.687500000000000098e-05,4.843749999999999965e-04,-1.126091575622558594e+01,-1.674413452148437500e+02,2.189175635576248063e-04,-3.117925822734832534e-04,1.718919724225997979e-04,-5.307101607322692836e-04,-4.702558368444443025e-05,4.836845695972442753e-04
1.264775390624999929e+01,-8.648432493209838867e-01,-2.848079528808593750e+02,-2.890624999999999857e-04,-1.328125000000000095e-04,2.851562499999999822e-04,1.562500000000000033e-04,5.742187499999999679e-04,4.179687499999999918e-04,-7.950784683227539062e+00,-2.918938903808593750e+02,-2.887641787528991491e-04,-1.334317177534103261e-04,2.854779362678527615e-04,1.553324609994888230e-04,5.742421150207519106e-04,4.189096391201019179e-04
1.624986718750000136e+01,-4.679549217224121094e+00,-3.412205200195312500e+02,3.828125000000000147e-04,8.203125000000000510e-05,-2.148437500000000011e-04,-3.007812499999999961e-04,-5.976562499999999887e-04,-2.968749999999999926e-04,-1.184422302246093750e+01,-3.483851623535156250e+02,3.801408708095550554e-04,8.000423014163971533e-05,-2.174974530935287417e-04,-3.001366257667541703e-04,-5.976383090019226274e-04,-2.975016832351684570e-04
1.902452734375000176e+01,-8.897874832153320312e+00,-3.699426269531250000e+02,-3.125000000000000065e-05,-8.398437499999999870e-04,1.953125000000000041e-05,-8.085937499999999592e-04,5.078124999999999767e-05,8.593750000000000043e-04,-1.695086479187011719e+01,-3.779956359863281250e+02,-3.350284695625305463e-05,-8.424394726753235262e-04,1.750883087515830988e-05,-8.089366555213928179e-04,5.101167783141136451e-05,8.599482774734497348e-04
1.927887890625000011e+01,0.000000000000000000e+00,-2.418735351562500000e+02,-2.343749999999999913e-04,-1.171874999999999957e-04,3.281250000000000204e-04,1.171874999999999957e-04,5.624999999999999575e-04,4.453125000000000160e-04,-6.718424797058105469e+00,-2.485919494628906250e+02,-2.350459545850753704e-04,-1.184112206101417558e-04,3.271689713001250965e-04,1.166347339749336282e-04,5.622149109840392971e-04,4.455802142620086882e-04
1.946295703124999932e+01,-4.280143380165100098e-01,-1.922003173828125000e+02,-2.382812499999999948e-04,-1.210937499999999991e-04,3.242187500000000169e-04,1.171874999999999957e-04,5.624999999999999575e-04,4.453125000000000160e-04,-7.823251724243164062e+00,-1.995955657958984375e+02,-2.361277639865875188e-04,-1.205790787935256985e-04,3.253809809684753466e-04,1.155486851930618338e-04,5.615087747573852591e-04,4.459600746631622284e-04
1.947200390624999855e+01,-2.675046443939208984e+00,-3.540697021484375000e+02,-3.085937500000000030e-04,-1.992187499999999872e-04,2.421874999999999983e-04,1.093750000000000023e-04,5.507812499999999471e-04,4.414062500000000126e-04,-1.207781600952148438e+01,-3.634724731445312500e+02,-3.086179494857788086e-04,-1.984919607639312701e-04,2.417792379856109717e-04,1.101259887218475385e-04,5.503972172737121469e-04,4.402711987495422146e-04
2.101682031249999838e+01,-2.119664192199707031e+00,-2.527494506835937500e+02,-2.421874999999999983e-04,-1.367187500000000130e-04,3.164062500000000100e-04,1.054687499999999988e-04,5.585937499999999540e-04,4.531250000000000230e-04,-6.565932750701904297e+00,-2.571957092285156250e+02,-2.419990599155425913e-04,-1.355432868003845343e-04,3.174764811992645381e-04,1.064557880163192810e-04,5.594755411148070751e-04,4.530197679996490452e-04
2.102587499999999920e+01,-2.474287986755371094e+00,-3.641997070312500000e+02,7.148437499999999844e-04,-2.109374999999999976e-04,2.343749999999999913e-04,-9.257812499999999549e-04,-4.804687499999999931e-04,4.453125000000000160e-04,-1.321338272094726562e+01,-3.749388122558593750e+02,7.143258452415465970e-04,-2.109344154596328662e-04,2.330024093389511115e-04,-9.252602458000182663e-04,-4.813234210014343158e-04,4.439368247985840048e-04
2.113858203124999946e+01,-1.498351097106933594e+00,-2.546927642822265625e+02,-2.382812499999999948e-04,-1.289062500000000061e-04,3.203125000000000134e-04,1.093750000000000023e-04,5.585937499999999540e-04,4.492187500000000195e-04,-6.338474750518798828e+00,-2.595328979492187500e+02,-2.378570586442947253e-04,-1.298433691263198796e-04,3.213420212268829502e-04,1.080136969685554442e-04,5.591990947723388724e-04,4.511854052543640267e-04
2.128843750000000057e+01,-9.206425547599792480e-01,-2.525939025878906250e+02,-2.343749999999999913e-04,-1.289062500000000061e-04,3.242187500000000169e-04,1.054687499999999988e-04,5.585937499999999540e-04,4.531250000000000230e-04,-6.760707855224609375e+00,-2.584339599609375000e+02,-2.320747375488281376e-04,-1.261299550533294693e-04,3.266596198081970397e-04,1.059447824954986547e-04,5.587343573570251231e-04,4.527895748615264819e-04
2.145186328124999875e+01,-4.367876052856445312e-01,-2.380912933349609375e+02,-2.304687499999999879e-04,-1.250000000000000026e-04,3.281250000000000204e-04,1.054687499999999988e-04,5.585937499999999540e-04,4.531250000000000230e-04,-7.735629081726074219e+00,-2.453901519775390625e+02,-2.325853854417800793e-04,-1.264128834009170424e-04,3.258621692657470942e-04,1.061724871397018400e-04,5.584475398063659494e-04,4.522750377655029397e-04
2.182534765624999906e+01,0.000000000000000000e+00,-2.510827941894531250e+02,2.460937500000000017e-04,-3.085937500000000030e-04,1.406249999999999894e-04,-5.546874999999999506e-04,-1.054687499999999988e-04,4.492187500000000195e-04,-1.061148738861083984e+01,-2.616943054199218750e+02,2.446463257074356335e-04,-3.098083734512328954e-04,1.390856802463531436e-04,-5.544546842575073320e-04,-1.055606454610824628e-04,4.488940536975860661e-04
2.191362499999999969e+01,0.000000000000000000e+00,-1.803836975097656250e+02,2.460937500000000017e-04,-3.085937500000000030e-04,1.406249999999999894e-04,-5.546874999999999506e-04,-1.054687499999999988e-04,4.492187500000000195e-04,-1.129665565490722656e+01,-1.916803588867187500e+02,2.456310391426086491e-04,-3.093989491462707559e-04,1.394264101982116639e-04,-5.550299882888794049e-04,-1.062046214938163732e-04,4.488253593444824197e-04
2.199364062500000117e+01,0.000000000000000000e+00,-2.027499694824218750e+02,2.460937500000000017e-04,-3.085937500000000030e-04,1.406249999999999894e-04,-5.546874999999999506e-04,-1.054687499999999988e-04,4.492187500000000195e-04,-1.099864482879638672e+01,-2.137486267089843750e+02,2.459680885076522710e-04,-3.090032637119293239e-04,1.402664780616760224e-04,-5.549713373184203980e-04,-1.057016104459762622e-04,4.492697417736053462e-04
2.204735937499999920e+01,0.000000000000000000e+00,-2.393016052246093750e+02,2.460937500000000017e-04,-3.085937500000000030e-04,1.406249999999999894e-04,-5.546874999999999506e-04,-1.054687499999999988e-04,4.492187500000000195e-04,-1.028518581390380859e+01,-2.495867919921875000e+02,2.456799149513244520e-04,-3.090406954288482514e-04,1.405819505453109752e-04,-5.547206401824950972e-04,-1.050979644060134904e-04,4.496226310729980568e-04
2.208690624999999841e+01,-5.580631494522094727e-01,-3.111159667968750000e+02,3.789062500000000113e-04,-1.171874999999999957e-04,-1.484374999999999963e-04,-4.960937500000000069e-04,-5.273437500000000347e-04,-3.125000000000000065e-05,-1.024248886108398438e+01,-3.208003540039062500e+02,3.813598752021789642e-04,-1.160370856523513822e-04,-1.480672955513000579e-04,-4.973969459533691224e-04,-5.294271707534790221e-04,-3.203020617365836972e-05
2.219373828124999903e+01,-1.141180276870727539e+00,-3.179834594726562500e+02,3.593749999999999939e-04,-1.132812500000000057e-04,-1.445312499999999928e-04,-4.726562499999999861e-04,-5.039062500000000139e-04,-3.125000000000000065e-05,-9.775868415832519531e+00,-3.266181640625000000e+02,3.561538457870483659e-04,-1.148076876997947750e-04,-1.460078656673431468e-04,-4.709615409374236987e-04,-5.021617412567138793e-04,-3.120017796754837177e-05
2.228914843749999974e+01,-9.623624086380004883e-01,-2.845812683105468750e+02,4.140624999999999883e-04,-1.132812500000000057e-04,-1.445312499999999928e-04,-5.273437500000000347e-04,-5.585937499999999540e-04,-3.125000000000000065e-05,-1.454882812500000000e+01,-2.981677551269531250e+02,4.147432446479797411e-04,-1.129032671451568663e-04,-1.442121714353561531e-04,-5.276465415954590147e-04,-5.589554309844970911e-04,-3.130889683961868161e-05
2.235535546874999824e+01,-1.970967501401901245e-01,-2.929952392578125000e+02,3.593749999999999939e-04,-1.132812500000000057e-04,-1.445312499999999928e-04,-4.726562499999999861e-04,-5.039062500000000139e-04,-3.125000000000000065e-05,-8.948741912841796875e+00,-3.017468872070312500e+02,3.585993647575378405e-04,-1.126353964209556539e-04,-1.449436098337173492e-04,-4.712347686290740793e-04,-5.035429596900940470e-04,-3.230821713805198772e-05
2.242238671875000122e+01,-1.891851544380187988e+00,-3.064864196777343750e+02,3.593749999999999939e-04,-1.093750000000000023e-04,-1.445312499999999928e-04,-4.687499999999999827e-04,-5.039062500000000139e-04,-3.515624999999999734e-05,-9.382516860961914062e+00,-3.139770812988281250e+02,3.569859862327575545e-04,-1.123069226741790766e-04,-1.464611738920211905e-04,-4.692929089069366446e-04,-5.034471750259398876e-04,-3.415425121784210032e-05
2.247759765625000128e+01,-1.308955192565917969e+00,-3.095868530273437500e+02,3.828125000000000147e-04,-1.132812500000000057e-04,-1.484374999999999963e-04,-4.960937500000000069e-04,-5.312500000000000382e-04,-3.515624999999999734e-05,-9.185583114624023438e+00,-3.174634704589843750e+02,3.836209475994110376e-04,-1.126808077096939134e-04,-1.475619226694107017e-04,-4.963017404079437134e-04,-5.311828255653381486e-04,-3.488111123442649587e-05
2.254212499999999864e+01,-1.824595212936401367e+00,-2.828866882324218750e+02,4.140624999999999883e-04,-1.132812500000000057e-04,-1.484374999999999963e-04,-5.273437500000000347e-04,-5.624999999999999575e-04,-3.515624999999999734e-05,-1.435670948028564453e+01,-2.954188232421875000e+02,4.138426482677459478e-04,-1.128006502985954266e-04,-1.476719379425048761e-04,-5.266433358192444073e-04,-5.615146160125732448e-04,-3.487129136919975546e-05
2.261352734375000040e+01,-4.837405979633331299e-01,-2.695990295410156250e+02,3.789062500000000113e-04,-1.132812500000000057e-04,-1.484374999999999963e-04,-4.921875000000000035e-04,-5.273437500000000347e-04,-3.515624999999999734e-05,-1.537525177001953125e+01,-2.844905395507812500e+02,3.789017200469970803e-04,-1.141667962074279825e-04,-1.488678902387618954e-04,-4.930685162544249951e-04,-5.277696251869201183e-04,-3.470109403133392638e-05
2.269264453125000003e+01,-1.816984367370605469e+01,-2.472648315429687500e+02,4.257812499999999987e-04,-1.171874999999999957e-04,-1.523437499999999998e-04,-5.429687500000000486e-04,-5.781249999999999714e-04,-3.515624999999999734e-05,-2.614826202392578125e+01,-2.552432403564453125e+02,4.267008900642395059e-04,-1.171955168247222926e-04,-1.522170454263687041e-04,-5.438963770866393505e-04,-5.789179205894469859e-04,-3.502153232693672419e-05
2.278214843749999829e+01,-1.624559760093688965e+00,-3.079905700683593750e+02,3.750000000000000078e-04,-1.210937499999999991e-04,-1.562500000000000033e-04,-4.960937500000000069e-04,-5.312500000000000382e-04,-3.515624999999999734e-05,-1.107622051239013672e+01,-3.174422302246093750e+02,3.759345710277557564e-04,-1.199566721916198723e-04,-1.551464498043060201e-04,-4.958912432193755609e-04,-5.310810208320617494e-04,-3.518978133797645379e-05
2.406258984375000054e+01,-6.720895767211914062e+00,-3.735004272460937500e+02,6.406250000000000269e-04,5.156250000000000243e-04,1.093750000000000023e-04,-1.250000000000000026e-04,-5.312500000000000382e-04,-4.062499999999999814e-04,-1.647288894653320312e+01,-3.832524414062500000e+02,6.414483785629272912e-04,5.149815678596496782e-04,1.092899516224861103e-04,-1.264668405055999797e-04,-5.321584343910217658e-04,-4.056915938854217590e-04
2.707075000000000031e+01,-3.998768925666809082e-01,-2.923953247070312500e+02,-2.617187500000000156e-04,-1.757812499999999935e-04,2.890624999999999857e-04,8.593749999999999501e-05,5.507812499999999471e-04,4.648437499999999792e-04,-6.215847969055175781e+00,-2.982113037109375000e+02,-2.629542946815490497e-04,-1.755005568265914921e-04,2.878778874874114908e-04,8.745375275611876802e-05,5.508322119712829885e-04,4.633784294128417860e-04
2.716453124999999957e+01,-1.034567832946777344e+00,-2.921620178222656250e+02,-2.578125000000000121e-04,-1.718749999999999900e-04,2.890624999999999857e-04,8.593749999999999501e-05,5.468750000000000520e-04,4.609374999999999757e-04,-8.181015014648437500e+00,-2.993084716796875000e+02,-2.607643306255340841e-04,-1.740149855613708544e-04,2.884628474712371926e-04,8.674935996532439947e-05,5.492271780967712767e-04,4.624778330326080470e-04
2.725363281250000114e+01,-6.657649278640747070e-01,-2.973658447265625000e+02,-2.578125000000000121e-04,-1.718749999999999900e-04,2.890624999999999857e-04,8.593749999999999501e-05,5.468750000000000520e-04,4.609374999999999757e-04,-8.255890846252441406e+00,-3.049559936523437500e+02,-2.569717168807983659e-04,-1.716350018978118831e-04,2.912904322147369125e-04,8.533670753240585717e-05,5.482621192932128846e-04,4.629254341125488498e-04
2.731330078124999972e+01,-6.544237732887268066e-01,-3.342886047363281250e+02,-2.851562499999999822e-04,-1.367187500000000130e-04,2.851562499999999822e-04,1.484374999999999963e-04,5.703124999999999644e-04,4.218749999999999952e-04,-1.002033042907714844e+01,-3.436545104980468750e+02,-2.861912846565246816e-04,-1.364226639270782482e-04,2.840424478054046574e-04,1.497686058282852095e-04,5.702337026596068911e-04,4.204651117324829327e-04
2.733208203124999969e+01,-7.862237095832824707e-01,-3.109721069335937500e+02,-2.539062500000000087e-04,-1.679687499999999866e-04,2.968749999999999926e-04,8.593749999999999501e-05,5.507812499999999471e-04,4.648437499999999792e-04,-7.240930080413818359e+00,-3.174267883300781250e+02,-2.528509795665741158e-04,-1.677648574113845827e-04,2.975360453128814771e-04,8.508612960577010436e-05,5.503870248794555387e-04,4.653008878231048358e-04
2.739972265624999892e+01,-4.186949431896209717e-01,-3.064227294921875000e+02,-2.460937500000000017e-04,-1.640625000000000102e-04,3.007812499999999961e-04,8.203125000000000510e-05,5.468750000000000520e-04,4.648437499999999792e-04,-7.207346439361572266e+00,-3.132113952636718750e+02,-2.476550489664077512e-04,-1.640111505985260125e-04,3.010364472866058341e-04,8.364390581846237779e-05,5.486915111541747821e-04,4.650475978851318195e-04
2.745508593750000159e+01,0.000000000000000000e+00,-3.263419189453125000e+02,-2.734375000000000260e-04,-1.250000000000000026e-04,2.968749999999999926e-04,1.484374999999999963e-04,5.703124999999999644e-04,4.218749999999999952e-04,-9.131042480468750000e+00,-3.354729919433593750e+02,-2.751692831516265700e-04,-1.254391968250274708e-04,2.958489358425140281e-04,1.497300714254379294e-04,5.710182189941405981e-04,4.212881326675415260e-04
2.746369140624999972e+01,-3.871488571166992188e+00,-3.042633666992187500e+02,-8.242187499999999731e-04,-6.992187499999999705e-04,-2.773437499999999753e-04,1.250000000000000026e-04,5.468750000000000520e-04,4.218749999999999952e-04,-1.243715667724609375e+01,-3.128290405273437500e+02,-8.256093859672546196e-04,-7.002202272415160647e-04,-2.792787849903106468e-04,1.253891587257385278e-04,5.463306307792663123e-04,4.209414422512054179e-04
3.255871484375000335e+01,-9.691882133483886719e+00,-3.867891845703125000e+02,9.453124999999999722e-04,8.867187500000000286e-04,4.648437499999999792e-04,-5.859374999999999783e-05,-4.804687499999999931e-04,-4.218749999999999952e-04,-1.844959640502929688e+01,-3.955468750000000000e+02,9.440150260925292674e-04,8.878647089004516142e-04,4.642570912837982121e-04,-5.615027248859405577e-05,-4.797579348087310552e-04,-4.236076474189758500e-04
3.284093359375000176e+01,-1.156955623626708984e+01,-3.288200683593750000e+02,3.789062500000000113e-04,-9.375000000000000195e-05,-1.757812499999999935e-04,-4.726562499999999861e-04,-5.546874999999999506e-04,-8.203125000000000510e-05,-1.826276016235351562e+01,-3.355132751464843750e+02,3.767473995685577414e-04,-9.753944724798201940e-05,-1.775607317686080848e-04,-4.742868542671203457e-04,-5.543081760406493898e-04,-8.002129197120666385e-05
3.295229296875000102e+01,0.000000000000000000e+00,-3.171827392578125000e+02,-2.187500000000000046e-04,-1.406249999999999894e-04,3.281250000000000204e-04,7.812500000000000163e-05,5.468750000000000520e-04,4.687499999999999827e-04,-9.622127532958984375e+00,-3.268048400878906250e+02,-2.199188023805618316e-04,-1.407931149005889945e-04,3.275439143180846951e-04,7.912568747997283719e-05,5.474627017974853299e-04,4.683370292186736896e-04
3.306620703125000205e+01,-8.696342818439006805e-03,-2.650757141113281250e+02,-2.187500000000000046e-04,-1.406249999999999894e-04,3.281250000000000204e-04,7.812500000000000163e-05,5.468750000000000520e-04,4.687499999999999827e-04,-1.041269779205322266e+01,-2.754797058105468750e+02,-2.198496162891387965e-04,-1.413757652044296130e-04,3.270887732505798414e-04,7.847384363412857153e-05,5.469383597373961899e-04,4.684645533561706513e-04
3.323614843749999892e+01,0.000000000000000000e+00,-1.949439697265625000e+02,-2.187500000000000046e-04,-1.406249999999999894e-04,3.281250000000000204e-04,7.812500000000000163e-05,5.468750000000000520e-04,4.687499999999999827e-04,-1.010137367248535156e+01,-2.050453338623046875e+02,-2.182656973600387588e-04,-1.409855484962463260e-04,3.282466530799865484e-04,7.728014886379241933e-05,5.465123653411865312e-04,4.692322015762329015e-04
3.343516406250000017e+01,-1.904082857072353363e-02,-2.030276641845703125e+02,-2.148437500000000011e-04,-1.406249999999999894e-04,3.320312500000000239e-04,7.421874999999999816e-05,5.468750000000000520e-04,4.726562499999999861e-04,-9.346209526062011719e+00,-2.123548583984375000e+02,-2.145198285579681501e-04,-1.402730941772460833e-04,3.316383361816406159e-04,7.424672693014145472e-05,5.461581349372864264e-04,4.719114303588866992e-04
3.364586328125000136e+01,-3.419728279113769531e-01,-2.238791198730468750e+02,-2.109374999999999976e-04,-1.406249999999999894e-04,3.320312500000000239e-04,7.031249999999999469e-05,5.429687500000000486e-04,4.726562499999999861e-04,-9.379596710205078125e+00,-2.329167480468750000e+02,-2.097649872303009055e-04,-1.384735703468322767e-04,3.345507383346557574e-04,7.129142433404922724e-05,5.443157553672790024e-04,4.730243086814880341e-04
3.383077343749999955e+01,0.000000000000000000e+00,-2.814206542968750000e+02,-2.070312499999999941e-04,-1.367187500000000130e-04,3.359374999999999731e-04,7.031249999999999469e-05,5.429687500000000486e-04,4.726562499999999861e-04,-8.933953285217285156e+00,-2.903546142578125000e+02,-2.070937305688858141e-04,-1.375433057546615601e-04,3.364263474941253467e-04,6.955041736364364201e-05,5.435200929641724119e-04,4.739696383476257099e-04
3.388465234374999824e+01,-6.225291490554809570e-01,-3.314754028320312500e+02,3.945312500000000252e-04,-9.765625000000000542e-05,-1.914062500000000074e-04,-4.921875000000000035e-04,-5.859374999999999783e-04,-9.375000000000000195e-05,-1.236009502410888672e+01,-3.432129516601562500e+02,3.944238126277923424e-04,-9.785951673984527566e-05,-1.909941583871841407e-04,-4.922833144664764482e-04,-5.854179859161376528e-04,-9.313463419675826658e-05
3.406714453125000119e+01,-1.432951450347900391e+00,-3.303825073242187500e+02,3.984374999999999744e-04,-9.375000000000000195e-05,-1.875000000000000039e-04,-4.921875000000000035e-04,-5.859374999999999783e-04,-9.375000000000000195e-05,-1.248845481872558594e+01,-3.414379882812500000e+02,3.976915776729583892e-04,-9.387929737567901329e-05,-1.879365146160125752e-04,-4.915708899497986265e-04,-5.856280922889709915e-04,-9.405721724033356190e-05
3.422169921874999687e+01,0.000000000000000000e+00,-1.108948822021484375e+02,3.281250000000000204e-04,-2.656250000000000191e-04,-1.171875000000000024e-05,-5.937499999999999853e-04,-3.398437499999999766e-04,2.539062500000000087e-04,-1.020738220214843750e+01,-1.211022644042968750e+02,3.267702460289001508e-04,-2.664015889167785562e-04,-1.244099065661430383e-05,-5.931718349456787612e-04,-3.392112255096435807e-04,2.539606094360351805e-04
3.439787109374999829e+01,-9.325461387634277344e+00,-4.163151245117187500e+02,-7.500000000000000156e-04,-4.296875000000000022e-04,-1.757812499999999935e-04,3.203125000000000134e-04,5.742187499999999679e-04,2.539062500000000087e-04,-2.040793609619140625e+01,-4.273976135253906250e+02,-7.511574029922485308e-04,-4.309819936752319267e-04,-1.768956035375595216e-04,3.201754093170166042e-04,5.742617845535277852e-04,2.540863752365112352e-04
3.440344531249999704e+01,-2.952409386634826660e-01,-1.271730651855468750e+02,3.281250000000000204e-04,-2.656250000000000191e-04,-1.171875000000000024e-05,-5.937499999999999853e-04,-3.398437499999999766e-04,2.539062500000000087e-04,-1.091092681884765625e+01,-1.377887573242187500e+02,3.269674479961395363e-04,-2.661401033401489345e-04,-1.277755759656429354e-05,-5.931075215339660228e-04,-3.397449851036071994e-04,2.533625364303588776e-04
3.473819531249999670e+01,-1.040990471839904785e+00,-1.660289306640625000e+02,3.203125000000000134e-04,-2.734375000000000260e-04,-1.953125000000000041e-05,-5.937499999999999853e-04,-3.398437499999999766e-04,2.539062500000000087e-04,-1.040025138854980469e+01,-1.753881988525390625e+02,3.179854154586791905e-04,-2.752726972103119074e-04,-2.158910967409610843e-05,-5.932580828666686500e-04,-3.395745158195495475e-04,2.536835968494415504e-04
3.936399609375000352e+01,-7.939332962036132812e+00,-4.126092834472656250e+02,1.019531250000000038e-03,1.089843750000000101e-03,4.765624999999999896e-04,7.031249999999999469e-05,-5.429687500000000486e-04,-6.132812500000000026e-04,-1.520527648925781250e+01,-4.198752136230468750e+02,1.020468115806579673e-03,1.091689586639404226e-03,4.786836206912994485e-04,7.122142612934112462e-05,-5.417844653129577767e-04,-6.130059361457824377e-04
4.127176562500000045e+01,-9.266396522521972656e+00,-4.058474426269531250e+02,-4.804687499999999931e-04,-9.414062499999999688e-04,-6.289062500000000165e-04,-4.609374999999999757e-04,-1.484374999999999963e-04,3.125000000000000065e-04,-1.673991966247558594e+01,-4.133209533691406250e+02,-4.820669591426849417e-04,-9.416456818580627025e-04,-6.294125318527222200e-04,-4.595787227153778150e-04,-1.473455876111984210e-04,3.122331500053405909e-04
4.335074218750000341e+01,-7.880311608314514160e-01,-3.090513916015625000e+02,3.437499999999999801e-04,-1.093750000000000023e-04,-1.757812499999999935e-04,-4.531250000000000230e-04,-5.195312500000000278e-04,-6.640625000000000477e-05,-9.563000679016113281e+00,-3.178263549804687500e+02,3.422466814517974862e-04,-1.091554462909698453e-04,-1.761405616998672598e-04,-4.514021277427673179e-04,-5.183872580528258887e-04,-6.698512285947799943e-05
4.351794140625000296e+01,-1.371437430381774902e+00,-3.026200561523437500e+02,3.632812499999999974e-04,-1.171874999999999957e-04,-1.835937500000000004e-04,-4.804687499999999931e-04,-5.468750000000000520e-04,-6.640625000000000477e-05,-7.678308963775634766e+00,-3.089269409179687500e+02,3.623280823230743330e-04,-1.176389679312706037e-04,-1.850735098123550463e-04,-4.799670279026031685e-04,-5.474015474319457886e-04,-6.743453443050384413e-05
4.367108203125000188e+01,-2.475226402282714844e+00,-3.019695129394531250e+02,3.320312500000000239e-04,-1.210937499999999991e-04,-1.914062500000000074e-04,-4.531250000000000230e-04,-5.234375000000000312e-04,-7.031249999999999469e-05,-1.170336914062500000e+01,-3.111976623535156250e+02,3.298202455043792872e-04,-1.215610280632972750e-04,-1.913430541753768997e-04,-4.513812661170959637e-04,-5.211632847785949629e-04,-6.978201866149902626e-05
4.383260156250000250e+01,-1.339336752891540527e+00,-3.122543029785156250e+02,3.281250000000000204e-04,-1.210937499999999991e-04,-1.914062500000000074e-04,-4.492187500000000195e-04,-5.195312500000000278e-04,-7.031249999999999469e-05,-9.021158218383789062e+00,-3.199360961914062500e+02,3.266178965568542229e-04,-1.222924515604972742e-04,-1.933490633964538529e-04,-4.489103555679321497e-04,-5.199669599533081029e-04,-7.105661928653717713e-05
4.398114843750000347e+01,-1.213371872901916504e+00,-2.983757019042968750e+02,3.828125000000000147e-04,-1.210937499999999991e-04,-1.953125000000000108e-04,-5.039062500000000139e-04,-5.781249999999999714e-04,-7.421874999999999816e-05,-1.226952171325683594e+01,-3.094318237304687500e+02,3.839859664440155177e-04,-1.207140684127807674e-04,-1.939053535461425786e-04,-5.047000050544738371e-04,-5.778912901878356483e-04,-7.319128513336181120e-05
4.409696093750000045e+01,-4.807333350181579590e-01,-2.923778991699218750e+02,3.828125000000000147e-04,-1.210937499999999991e-04,-1.953125000000000108e-04,-5.039062500000000139e-04,-5.781249999999999714e-04,-7.421874999999999816e-05,-1.235270500183105469e+01,-3.042498779296875000e+02,3.845362961292267097e-04,-1.198815703392028806e-04,-1.942091584205627569e-04,-5.044178962707519028e-04,-5.787454843521117791e-04,-7.432758808135986274e-05
4.424888281249999977e+01,0.000000000000000000e+00,-2.896451110839843750e+02,3.828125000000000147e-04,-1.210937499999999991e-04,-1.953125000000000108e-04,-5.039062500000000139e-04,-5.781249999999999714e-04,-7.421874999999999816e-05,-1.133120918273925781e+01,-3.009763183593750000e+02,3.843765258789062517e-04,-1.198157966136932407e-04,-1.946491301059723004e-04,-5.041923522949218455e-04,-5.790256857872009459e-04,-7.483334094285964467e-05
4.427374609374999892e+01,-1.280813407897949219e+01,-4.194982299804687500e+02,7.421874999999999816e-05,-3.242187500000000169e-04,1.523437499999999998e-04,-3.984374999999999744e-04,7.812500000000000163e-05,4.765624999999999896e-04,-2.208369827270507812e+01,-4.287737731933593750e+02,7.579113543033599268e-05,-3.242596983909607042e-04,1.520157605409622127e-04,-4.000508189201354729e-04,7.622461766004562161e-05,4.762754440307617201e-04
4.573428515625000301e+01,-3.436813354492187500e-01,-2.415770111083984375e+02,-2.148437500000000011e-04,-1.367187500000000130e-04,3.320312500000000239e-04,7.812500000000000163e-05,5.468750000000000520e-04,4.687499999999999827e-04,-6.795658111572265625e+00,-2.480289916992187500e+02,-2.151573598384857230e-04,-1.356700658798217873e-04,3.335639238357544149e-04,7.948729395866393566e-05,5.487213134765624774e-04,4.692339897155761480e-04
4.588947265624999972e+01,0.000000000000000000e+00,-2.241781005859375000e+02,-2.187500000000000046e-04,-1.367187500000000130e-04,3.320312500000000239e-04,8.203125000000000510e-05,5.507812499999999471e-04,4.687499999999999827e-04,-7.602641105651855469e+00,-2.317807312011718750e+02,-2.173084169626235949e-04,-1.351936161518097000e-04,3.331933319568633847e-04,8.211480081081390847e-05,5.505017042160034431e-04,4.683869183063507180e-04
4.605272265624999761e+01,-5.638675689697265625e-01,-2.146970367431640625e+02,-2.187500000000000046e-04,-1.367187500000000130e-04,3.281250000000000204e-04,8.203125000000000510e-05,5.468750000000000520e-04,4.648437499999999792e-04,-8.841811180114746094e+00,-2.229749908447265625e+02,-2.200907617807388195e-04,-1.372859477996826076e-04,3.285278975963592260e-04,8.280481398105621186e-05,5.486186742782592695e-04,4.658138453960418879e-04
4.620678515624999960e+01,-8.171217441558837891e-01,-2.141902770996093750e+02,-2.265625000000000115e-04,-1.406249999999999894e-04,3.242187500000000169e-04,8.593749999999999501e-05,5.507812499999999471e-04,4.648437499999999792e-04,-8.989566802978515625e+00,-2.223627014160156250e+02,-2.255231589078903072e-04,-1.411090940237045329e-04,3.244721889495849479e-04,8.441404998302459099e-05,5.499953627586364521e-04,4.655812978744507048e-04
4.634748828125000131e+01,-2.090962529182434082e-01,-2.166187438964843750e+02,-2.304687499999999879e-04,-1.445312499999999928e-04,3.203125000000000134e-04,8.593749999999999501e-05,5.507812499999999471e-04,4.648437499999999792e-04,-8.925514221191406250e+00,-2.253351593017578125e+02,-2.305052429437637286e-04,-1.458185166120529196e-04,3.196890950202942129e-04,8.468671888113022404e-05,5.501943230628966904e-04,4.655076265335082752e-04
4.656938281250000244e+01,0.000000000000000000e+00,-2.304245605468750000e+02,-2.421874999999999983e-04,-1.562500000000000033e-04,3.085937500000000030e-04,8.593749999999999501e-05,5.507812499999999471e-04,4.648437499999999792e-04,-9.212740898132324219e+00,-2.396372985839843750e+02,-2.407295107841491810e-04,-1.551803648471832150e-04,3.091898560523986968e-04,8.554914593696593891e-05,5.499193668365478507e-04,4.643702208995819118e-04
5.038826562500000250e+01,-7.815766334533691406e+00,-4.185516967773437500e+02,-7.617187500000000260e-04,-9.531249999999999792e-04,-4.414062500000000126e-04,-1.914062500000000074e-04,3.203125000000000134e-04,5.117187500000000208e-04,-1.697056388854980469e+01,-4.277064819335937500e+02,-7.625866532325744707e-04,-9.532651305198669564e-04,-4.417291283607482715e-04,-1.906784623861312888e-04,3.208575248718261450e-04,5.115360021591186307e-04
5.087715234374999795e+01,0.000000000000000000e+00,-2.536777648925781250e+02,-2.187500000000000046e-04,-1.328125000000000095e-04,3.320312500000000239e-04,8.593749999999999501e-05,5.507812499999999471e-04,4.648437499999999792e-04,-6.368613719940185547e+00,-2.600463867187500000e+02,-2.194469720125198295e-04,-1.326460689306259270e-04,3.329430818557739362e-04,8.680090308189391602e-05,5.523900389671325146e-04,4.655891358852386392e-04
5.103107812500000051e+01,-5.375328063964843750e-01,-2.102374877929687500e+02,-2.187500000000000046e-04,-1.289062500000000061e-04,3.359374999999999731e-04,8.984374999999999848e-05,5.546874999999999506e-04,4.648437499999999792e-04,-7.868721961975097656e+00,-2.175686798095703125e+02,-2.177823334932327271e-04,-1.281158477067947498e-04,3.357119858264923096e-04,8.966649323701858922e-05,5.534943342208861793e-04,4.638278186321258354e-04
5.119315625000000125e+01,-4.631657898426055908e-01,-1.932378540039062500e+02,-2.187500000000000046e-04,-1.289062500000000061e-04,3.320312500000000239e-04,8.984374999999999848e-05,5.507812499999999471e-04,4.609374999999999757e-04,-8.220238685607910156e+00,-2.009949340820312500e+02,-2.186964154243469351e-04,-1.277880221605301014e-04,3.340509831905364877e-04,9.090840071439743215e-05,5.527473688125610291e-04,4.618389904499054194e-04
5.120255468749999750e+01,-5.710837841033935547e-01,-3.568242797851562500e+02,-2.968749999999999926e-04,-2.109374999999999976e-04,2.460937500000000017e-04,8.593749999999999501e-05,5.429687500000000486e-04,4.570312500000000265e-04,-9.877205848693847656e+00,-3.661303710937500000e+02,-2.979393601417541413e-04,-2.109237015247345025e-04,2.453528940677642727e-04,8.701565861701965234e-05,5.432922840118408619e-04,4.562765955924988023e-04
5.136313671874999898e+01,-5.743719935417175293e-01,-2.077601013183593750e+02,-2.226562500000000080e-04,-1.289062500000000061e-04,3.320312500000000239e-04,9.375000000000000195e-05,5.546874999999999506e-04,4.609374999999999757e-04,-6.782944202423095703e+00,-2.139686737060546875e+02,-2.242317646741867111e-04,-1.317924410104751693e-04,3.298307359218597247e-04,9.243933856487273866e-05,5.540624856948852660e-04,4.616231620311737243e-04
5.137253515625000233e+01,-1.695543766021728516e+00,-3.368994140625000000e+02,8.867187500000000286e-04,-2.148437500000000011e-04,2.382812499999999948e-04,-1.101562499999999894e-03,-6.484375000000000338e-04,4.531250000000000230e-04,-2.526437950134277344e+01,-3.604682617187500000e+02,8.793530464172363012e-04,-2.074603438377380354e-04,2.379028499126434239e-04,-1.086813330650329657e-03,-6.414501667022704835e-04,4.453631937503814593e-04
5.261849218750000290e+01,-5.302922129631042480e-01,-2.967113952636718750e+02,-2.578125000000000121e-04,-9.375000000000000195e-05,3.164062500000000100e-04,1.640625000000000102e-04,5.742187499999999679e-04,4.101562499999999848e-04,-8.950984954833984375e+00,-3.051320800781250000e+02,-2.599158883094787576e-04,-9.485688805580139583e-05,3.158206939697265412e-04,1.650590002536773753e-04,5.757365822792052988e-04,4.106775820255279506e-04
5.375321093750000045e+01,-4.723757505416870117e-02,-2.554598236083984375e+02,-2.148437500000000011e-04,-1.171874999999999957e-04,3.437499999999999801e-04,9.765625000000000542e-05,5.585937499999999540e-04,4.609374999999999757e-04,-5.117716789245605469e+00,-2.605303039550781250e+02,-2.139085233211517252e-04,-1.171103194355964725e-04,3.433770239353179906e-04,9.679821133613586469e-05,5.572855472564697699e-04,4.604873359203338510e-04
5.391387499999999733e+01,-3.485228493809700012e-02,-2.250496063232421875e+02,-2.109374999999999976e-04,-1.210937499999999991e-04,3.437499999999999801e-04,8.984374999999999848e-05,5.546874999999999506e-04,4.648437499999999792e-04,-5.774556159973144531e+00,-2.307893218994140625e+02,-2.131142765283584590e-04,-1.226113885641097977e-04,3.413590788841247732e-04,9.050289541482925979e-05,5.544734001159668229e-04,4.639704823493957407e-04
5.408713671875000273e+01,-2.397894859313964844e+00,-2.179234008789062500e+02,-2.109374999999999976e-04,-1.250000000000000026e-04,4.062499999999999814e-04,8.593749999999999501e-05,6.171875000000000061e-04,5.312500000000000382e-04,-1.214316844940185547e+01,-2.276686706542968750e+02,-2.129889279603958087e-04,-1.270062029361724882e-04,4.061290919780731349e-04,8.598272502422333403e-05,6.191180348396300862e-04,5.331352949142455959e-04
5.426607812499999994e+01,-9.268180131912231445e-01,-2.288169555664062500e+02,-2.109374999999999976e-04,-1.289062500000000061e-04,3.828125000000000147e-04,8.203125000000000510e-05,5.937499999999999853e-04,5.117187500000000208e-04,-1.230835056304931641e+01,-2.401984863281250000e+02,-2.106487452983856086e-04,-1.280720978975295906e-04,3.826594352722167990e-04,8.257663995027541962e-05,5.933081507682799868e-04,5.107315182685852198e-04
5.444774609374999841e+01,-1.275402188301086426e+00,-2.441199493408203125e+02,-2.070312499999999941e-04,-1.250000000000000026e-04,3.867187500000000182e-04,8.203125000000000510e-05,5.937499999999999853e-04,5.117187500000000208e-04,-1.205379295349121094e+01,-2.548983459472656250e+02,-2.086794674396514921e-04,-1.268685460090637328e-04,3.843877911567688188e-04,8.181091398000717434e-05,5.930672287940978900e-04,5.112563371658325516e-04
5.458745312500000324e+01,0.000000000000000000e+00,-2.671852111816406250e+02,-2.070312499999999941e-04,-1.250000000000000026e-04,3.437499999999999801e-04,8.203125000000000510e-05,5.507812499999999471e-04,4.687499999999999827e-04,-5.230654716491699219e+00,-2.724158630371093750e+02,-2.080351561307907196e-04,-1.260337978601455775e-04,3.428271114826202570e-04,8.200136572122574048e-05,5.508622527122497255e-04,4.688608944416046377e-04
5.469463281249999653e+01,-3.639812115579843521e-03,-2.750397338867187500e+02,-2.109374999999999976e-04,-1.289062500000000061e-04,3.398437499999999766e-04,8.203125000000000510e-05,5.507812499999999471e-04,4.687499999999999827e-04,-5.325198650360107422e+00,-2.803612976074218750e+02,-2.093249857425689682e-04,-1.276042461395263702e-04,3.421898782253265134e-04,8.172074705362319643e-05,5.515148639678955087e-04,4.697940945625305440e-04
5.482935156250000119e+01,-5.979933738708496094e-01,-2.575593872070312500e+02,-2.109374999999999976e-04,-1.328125000000000095e-04,3.828125000000000147e-04,7.812500000000000163e-05,5.937499999999999853e-04,5.156250000000000243e-04,-1.118777370452880859e+01,-2.681491699218750000e+02,-2.112217992544174129e-04,-1.318108886480331434e-04,3.823617398738861231e-04,7.941091805696486798e-05,5.935835242271423392e-04,5.141726136207580697e-04
5.492097656250000171e+01,-1.690528392791748047e+00,-2.596608276367187500e+02,-2.109374999999999976e-04,-1.328125000000000095e-04,3.828125000000000147e-04,7.812500000000000163e-05,5.937499999999999853e-04,5.156250000000000243e-04,-1.256247043609619141e+01,-2.705327758789062500e+02,-2.146335542201995895e-04,-1.345957666635513232e-04,3.794178664684295607e-04,8.003778010606765433e-05,5.940514206886291773e-04,5.140136480331421349e-04
5.500937890624999937e+01,-6.137416362762451172e-01,-2.515346984863281250e+02,-2.148437500000000011e-04,-1.367187500000000130e-04,3.789062500000000113e-04,7.812500000000000163e-05,5.937499999999999853e-04,5.156250000000000243e-04,-1.270372962951660156e+01,-2.636246643066406250e+02,-2.157157808542251693e-04,-1.369850933551788430e-04,3.775127530097961595e-04,7.873068749904632633e-05,5.932285189628601048e-04,5.144978761672973962e-04
5.509471484374999761e+01,-1.238695502281188965e+00,-2.512618408203125000e+02,-2.187500000000000046e-04,-1.406249999999999894e-04,3.750000000000000078e-04,7.812500000000000163e-05,5.937499999999999853e-04,5.156250000000000243e-04,-1.114313125610351562e+01,-2.611662902832031250e+02,-2.173171043395996161e-04,-1.395157873630523560e-04,3.748547136783599932e-04,7.780131697654724652e-05,5.921718478202820301e-04,5.143705010414123492e-04
5.516729296874999733e+01,-8.829120397567749023e-01,-2.535707855224609375e+02,-2.148437500000000011e-04,-1.406249999999999894e-04,3.750000000000000078e-04,7.421874999999999816e-05,5.898437499999999818e-04,5.156250000000000243e-04,-1.046499633789062500e+01,-2.631528625488281250e+02,-2.166028022766113394e-04,-1.408406943082809396e-04,3.737115561962127712e-04,7.576210796833038623e-05,5.903143286705017168e-04,5.145522356033325681e-04
5.517670703124999676e+01,-2.215041399002075195e+00,-3.623656616210937500e+02,8.750000000000000182e-04,-2.265625000000000115e-04,2.382812499999999948e-04,-1.101562499999999894e-03,-6.367187500000000234e-04,4.648437499999999792e-04,-6.208205223083496094e+00,-3.663587951660156250e+02,8.823925256729126063e-04,-2.346723228693008536e-04,2.392612695693969679e-04,-1.117064833641052317e-03,-6.431312561035155842e-04,4.739335775375366246e-04
5.523356640624999869e+01,-1.001039862632751465e+00,-2.434328308105468750e+02,-2.148437500000000011e-04,-1.406249999999999894e-04,3.320312500000000239e-04,7.421874999999999816e-05,5.468750000000000520e-04,4.726562499999999861e-04,-7.373402118682861328e+00,-2.498052062988281250e+02,-2.156128883361816415e-04,-1.406248956918716383e-04,3.322767615318298392e-04,7.498797774314880631e-05,5.478896498680114807e-04,4.729016721248626744e-04
5.529541015625000000e+01,-8.819953918457031250e+00,-2.688878173828125000e+02,5.273437500000000347e-04,-7.031249999999999469e-05,3.750000000000000078e-04,-5.976562499999999887e-04,-1.523437499999999998e-04,4.453125000000000160e-04,-1.263064479827880859e+01,-2.726985168457031250e+02,5.239551663398742684e-04,-7.246793806552886941e-05,3.727523088455200252e-04,-5.964230895042419139e-04,-1.512028574943542433e-04,4.452202618122100644e-04
5.530537499999999795e+01,-6.015240550041198730e-01,-2.447828063964843750e+02,-2.148437500000000011e-04,-1.406249999999999894e-04,3.320312500000000239e-04,7.421874999999999816e-05,5.468750000000000520e-04,4.726562499999999861e-04,-7.625889778137207031e+00,-2.518071746826171875e+02,-2.143626213073730410e-04,-1.402634680271148753e-04,3.326801657676696847e-04,7.409914582967758081e-05,5.470427870750426986e-04,4.729436337947845329e-04
5.531479687499999898e+01,-3.348862648010253906e+00,-3.654669189453125000e+02,-2.968749999999999926e-04,-2.226562500000000080e-04,2.382812499999999948e-04,7.421874999999999816e-05,5.351562500000000416e-04,4.609374999999999757e-04,-1.287855148315429688e+01,-3.749966430664062500e+02,-2.960825264453887762e-04,-2.226470112800598105e-04,2.399255335330963016e-04,7.343550771474838073e-05,5.360080599784851048e-04,4.625725448131561392e-04
5.540008984375000267e+01,-7.816893458366394043e-01,-2.450223083496093750e+02,-2.109374999999999976e-04,-1.367187500000000130e-04,3.359374999999999731e-04,7.421874999999999816e-05,5.468750000000000520e-04,4.726562499999999861e-04,-6.951415538787841797e+00,-2.511920318603515625e+02,-2.126339077949524045e-04,-1.391494423151016244e-04,3.341690599918365227e-04,7.348447293043136499e-05,5.468029975891113481e-04,4.733185172080993440e-04
5.551262499999999989e+01,-1.101665019989013672e+00,-2.417214355468750000e+02,-2.109374999999999976e-04,-1.406249999999999894e-04,3.320312500000000239e-04,7.031249999999999469e-05,5.429687500000000486e-04,4.726562499999999861e-04,-7.628155231475830078e+00,-2.482479248046875000e+02,-2.114001959562301534e-04,-1.395387202501296975e-04,3.351325094699859767e-04,7.186146825551987095e-05,5.465326905250549603e-04,4.746712446212768711e-04
5.559803124999999824e+01,-6.201171875000000000e-01,-2.384836578369140625e+02,-2.109374999999999976e-04,-1.406249999999999894e-04,3.320312500000000239e-04,7.031249999999999469e-05,5.429687500000000486e-04,4.726562499999999861e-04,-7.465364456176757812e+00,-2.453289031982421875e+02,-2.117357701063156091e-04,-1.404638290405273496e-04,3.343540430068969575e-04,7.127194106578827305e-05,5.460898280143737906e-04,4.748178720474243342e-04
5.567755859374999972e+01,-6.185983419418334961e-01,-2.361423339843750000e+02,-2.109374999999999976e-04,-1.406249999999999894e-04,3.320312500000000239e-04,7.031249999999999469e-05,5.429687500000000486e-04,4.726562499999999861e-04,-7.273598670959472656e+00,-2.427973327636718750e+02,-2.127791643142700254e-04,-1.418503671884536663e-04,3.327175080776214851e-04,7.092879712581634554e-05,5.454967021942138230e-04,4.745678603649139274e-04
5.577579687499999750e+01,-1.163661926984786987e-01,-2.374140625000000000e+02,-2.148437500000000011e-04,-1.445312499999999928e-04,3.320312500000000239e-04,7.031249999999999469e-05,5.468750000000000520e-04,4.765624999999999896e-04,-7.130337715148925781e+00,-2.444280242919921875e+02,-2.145984470844268879e-04,-1.443106532096862708e-04,3.320013284683227535e-04,7.028779387474060351e-05,5.465998053550720623e-04,4.763119816780090514e-04
5.590824218750000085e+01,-1.443068683147430420e-01,-2.395543212890625000e+02,-2.148437500000000011e-04,-1.445312499999999928e-04,3.320312500000000239e-04,7.031249999999999469e-05,5.468750000000000520e-04,4.765624999999999896e-04,-7.043300628662109375e+00,-2.464533233642578125e+02,-2.164718955755233899e-04,-1.466772109270095877e-04,3.290678262710571077e-04,6.979467719793320374e-05,5.455397367477417487e-04,4.757450520992278923e-04
5.607008593749999648e+01,-3.541425168514251709e-01,-2.665590209960937500e+02,-2.148437500000000011e-04,-1.445312499999999928e-04,3.320312500000000239e-04,7.031249999999999469e-05,5.468750000000000520e-04,4.765624999999999896e-04,-6.037160873413085938e+00,-2.722420654296875000e+02,-2.159280627965927109e-04,-1.468253135681152441e-04,3.300964534282684482e-04,6.910274922847748030e-05,5.460245013236999893e-04,4.769217669963836653e-04
5.609933984375000193e+01,-7.977499485015869141e+00,-3.594289550781250000e+02,-1.210937499999999991e-04,-4.296875000000000022e-04,5.624999999999999575e-04,-3.085937500000000030e-04,6.835937499999999566e-04,9.921875000000000139e-04,-1.454019737243652344e+01,-3.659916687011718750e+02,-1.187866330146789614e-04,-4.201075434684753223e-04,5.666201710700988345e-04,-3.013209104537963880e-04,6.854068040847778771e-04,9.867277145385743194e-04
5.857530859375000176e+01,-9.999643325805664062e+00,-3.801290893554687500e+02,-4.960937500000000069e-04,-2.109374999999999976e-04,-3.007812499999999961e-04,2.851562499999999822e-04,1.953125000000000108e-04,-8.984374999999999848e-05,-1.961011695861816406e+01,-3.897395324707031250e+02,-4.965519905090332161e-04,-2.113159000873565685e-04,-3.010774552822113089e-04,2.852360904216766206e-04,1.954745352268219072e-04,-8.976154774427414201e-05
6.458302734375000398e+01,-1.006802558898925781e+01,-3.688039855957031250e+02,6.054687499999999957e-04,6.757812499999999497e-04,5.546874999999999506e-04,7.031249999999999469e-05,-5.078124999999999767e-05,-1.210937499999999991e-04,-1.963679122924804688e+01,-3.783727722167968750e+02,6.068463921546935619e-04,6.771933436393737715e-04,5.564607977867126092e-04,7.034695148468018250e-05,-5.038562417030334646e-05,-1.207325756549835154e-04
6.868430859375000352e+01,-9.580429077148437500e+00,-4.197506713867187500e+02,-9.843750000000000069e-04,-6.718749999999999462e-04,-1.210937499999999991e-04,3.125000000000000065e-04,8.632812500000000078e-04,5.507812499999999471e-04,-1.869405555725097656e+01,-4.288642883300781250e+02,-9.840817451477049723e-04,-6.709917187690734620e-04,-1.203720644116401710e-04,3.130900263786316187e-04,8.637096881866455217e-04,5.506196618080139030e-04
7.442980859374999625e+01,-8.450320243835449219e+00,-4.204660644531250000e+02,5.195312500000000278e-04,3.750000000000000078e-04,3.632812499999999974e-04,-1.445312499999999928e-04,-1.562500000000000033e-04,-1.171875000000000024e-05,-1.613657379150390625e+01,-4.281523437500000000e+02,5.189072489738464061e-04,3.753637075424194332e-04,3.621451258659362949e-04,-1.435435265302658031e-04,-1.567621082067489685e-04,-1.321857701987028117e-05
7.603293359375000193e+01,-7.458985328674316406e+00,-4.223657226562500000e+02,3.515624999999999734e-05,8.828125000000000252e-04,1.601562500000000067e-04,8.476562499999999939e-04,1.250000000000000026e-04,-7.226562499999999913e-04,-1.419591712951660156e+01,-4.291026306152343750e+02,3.539115190505981364e-05,8.834608793258666524e-04,1.591512262821197590e-04,8.480697274208068726e-04,1.237600669264793266e-04,-7.243096828460693143e-04
7.742912109374999829e+01,-7.018978118896484375e+00,-3.693379211425781250e+02,6.953124999999999670e-04,7.421875000000000087e-04,2.148437500000000011e-04,4.687500000000000098e-05,-4.804687499999999931e-04,-5.273437500000000347e-04,-1.509019279479980469e+01,-3.774091186523437500e+02,6.959176063537597353e-04,7.417316436767577587e-04,2.164465636014938381e-04,4.581407085061073000e-05,-4.794710278511047545e-04,-5.252851247787475655e-04
8.363468359374999750e+01,-9.428995132446289062e+00,-3.871448364257812500e+02,-3.984374999999999744e-04,7.812500000000000163e-06,-3.320312500000000239e-04,4.062499999999999814e-04,6.640625000000000477e-05,-3.398437499999999766e-04,-1.687426757812500000e+01,-3.945901489257812500e+02,-3.983383476734161325e-04,6.139598321169614744e-06,-3.330938518047332655e-04,4.044779539108276441e-04,6.524450331926345186e-05,-3.392334580421447771e-04
8.447043359375000193e+01,-1.479622077941894531e+01,-3.421099243164062500e+02,3.906250000000000081e-06,-1.445312499999999928e-04,-1.015625000000000035e-03,-1.484374999999999963e-04,-1.019531250000000038e-03,-8.710937500000000147e-04,-2.209143066406250000e+01,-3.494051513671875000e+02,5.453570629470050606e-07,-1.470933854579925602e-04,-1.019029259681701561e-03,-1.476387381553649961e-04,-1.019574522972106897e-03,-8.719358444213867699e-04
8.452062109374999466e+01,-9.220242500305175781e+00,-3.726402587890625000e+02,-1.093750000000000023e-04,-2.070312499999999941e-04,3.125000000000000065e-05,-9.765625000000000542e-05,1.406249999999999894e-04,2.382812499999999948e-04,-1.740279197692871094e+01,-3.808228149414062500e+02,-1.092302054166793764e-04,-2.078560441732406642e-04,3.041267022490501382e-05,-9.862583875656127431e-05,1.396428793668746894e-04,2.382687181234359637e-04
8.552338671875000387e+01,-4.320586472749710083e-02,-3.234777526855468750e+02,-1.250000000000000026e-04,-2.656250000000000191e-04,2.968749999999999926e-04,-1.406249999999999894e-04,4.218749999999999952e-04,5.624999999999999575e-04,-1.032147407531738281e+01,-3.337559814453125000e+02,-1.263710260391235349e-04,-2.663359045982360840e-04,2.969264984130859592e-04,-1.399648785591125490e-04,4.232974946498870733e-04,5.632624030113220432e-04
8.564933203124999750e+01,-1.330932497978210449e+00,-3.297460327148437500e+02,-1.250000000000000026e-04,-2.656250000000000191e-04,2.968749999999999926e-04,-1.406249999999999894e-04,4.218749999999999952e-04,5.624999999999999575e-04,-1.240365886688232422e+01,-3.408187255859375000e+02,-1.260722279548645065e-04,-2.666297256946563833e-04,2.968846559524536215e-04,-1.405574828386306800e-04,4.229568839073181009e-04,5.635143518447875569e-04
8.618702734375000318e+01,-9.223177909851074219e+00,-3.659507751464843750e+02,-7.421874999999999816e-05,-5.429687500000000486e-04,-5.429687500000000486e-04,-4.687499999999999827e-04,-4.687499999999999827e-04,0.000000000000000000e+00,-1.937568473815917969e+01,-3.761032714843750000e+02,-7.382289320230484269e-05,-5.424659252166747631e-04,-5.415955185890197841e-04,-4.686430394649505459e-04,-4.677726328372955127e-04,8.704118081368505777e-07
8.959221484374999989e+01,-9.593891143798828125e+00,-3.853463134765625000e+02,-4.492187500000000195e-04,-1.089843750000000101e-03,-7.734375000000000364e-04,-6.406250000000000269e-04,-3.242187500000000169e-04,3.164062500000000100e-04,-1.642189216613769531e+01,-3.921743164062500000e+02,-4.488820731639862113e-04,-1.089418888092041080e-03,-7.717665433883666480e-04,-6.405368447303771539e-04,-3.228844404220580972e-04,3.176523745059967171e-04
9.501330859374999704e+01,-8.164075851440429688e+00,-3.858890380859375000e+02,4.335937500000000056e-04,-2.031249999999999907e-04,2.890624999999999857e-04,-6.367187500000000234e-04,-1.445312499999999928e-04,4.921875000000000035e-04,-1.879909706115722656e+01,-3.965240783691406250e+02,4.336481392383575171e-04,-2.032460123300552425e-04,2.890355885028838894e-04,-6.368941664695739564e-04,-1.446125656366348245e-04,4.922815859317779350e-04
9.986887109375000193e+01,-7.925406455993652344e+00,-3.869940490722656250e+02,-5.781249999999999714e-04,-1.042968750000000059e-03,-8.984374999999999848e-05,-4.648437499999999792e-04,4.882812500000000000e-04,9.531249999999999792e-04,-1.746680831909179688e+01,-3.965354614257812500e+02,-5.800958871841430803e-04,-1.043966531753539977e-03,-9.156771749258041696e-05,-4.638707041740417381e-04,4.885281622409820513e-04,9.523988366127014498e-04
1.035398085937499957e+02,-6.137451529502868652e-02,-3.012549133300781250e+02,-8.203125000000000510e-05,-3.007812499999999961e-04,2.773437499999999753e-04,-2.187500000000000046e-04,3.593749999999999939e-04,5.781249999999999714e-04,-1.193292999267578125e+01,-3.131264648437500000e+02,-8.168152719736099525e-05,-2.998670041561126765e-04,2.785080373287200954e-04,-2.181854844093322797e-04,3.601895868778228860e-04,5.783750414848327177e-04
1.037039218750000060e+02,-4.786794781684875488e-01,-3.075115661621093750e+02,-8.203125000000000510e-05,-3.007812499999999961e-04,2.773437499999999753e-04,-2.187500000000000046e-04,3.593749999999999939e-04,5.781249999999999714e-04,-1.275030517578125000e+01,-3.197832031250000000e+02,-8.133379369974136277e-05,-2.996985018253326338e-04,2.787923216819763409e-04,-2.183647155761718830e-04,3.601261079311370646e-04,5.784908533096313685e-04
1.052135898437500003e+02,-1.035721015930175781e+01,-3.708681945800781250e+02,-3.906250000000000081e-06,6.757812499999999497e-04,3.906250000000000081e-06,6.796874999999999532e-04,7.812500000000000163e-06,-6.718749999999999462e-04,-2.092116165161132812e+01,-3.814321594238281250e+02,-3.742985893040895557e-06,6.764795780181884471e-04,4.229480866342782967e-06,6.802225708961486808e-04,7.972466759383677677e-06,-6.722500920295715679e-04
1.114151523437499947e+02,-1.044954299926757812e+01,-3.820726928710937500e+02,3.789062500000000113e-04,-1.718749999999999900e-04,5.507812499999999471e-04,-5.507812499999999471e-04,1.718749999999999900e-04,7.226562499999999913e-04,-2.149991035461425781e+01,-3.931230468750000000e+02,3.787377476692199685e-04,-1.716627031564712516e-04,5.507702827453613177e-04,-5.504004359245300232e-04,1.720325499773025461e-04,7.224329710006714266e-04
1.144419843750000041e+02,-9.942675590515136719e+00,-4.185620727539062500e+02,-6.289062500000000165e-04,-1.066406250000000080e-03,-1.101562499999999894e-03,-4.375000000000000091e-04,-4.726562499999999861e-04,-3.515624999999999734e-05,-9.517301559448242188e+00,-4.181367187500000000e+02,-6.468278169631957617e-04,-1.088307619094848683e-03,-1.178413510322570776e-03,-4.414798021316528129e-04,-5.315856933593750147e-04,-9.010589122772217469e-05
1.189838085937499983e+02,-9.721354484558105469e+00,-3.860985717773437500e+02,-5.468750000000000114e-05,-3.320312500000000239e-04,-7.500000000000000156e-04,-2.773437499999999753e-04,-6.953124999999999670e-04,-4.179687499999999918e-04,-2.002335739135742188e+01,-3.964005737304687500e+02,-5.653204768896102954e-05,-3.329503536224364974e-04,-7.511335611343383963e-04,-2.764182984828948762e-04,-6.946015357971191146e-04,-4.181832373142242384e-04
