{
    "Line1": [
        [
            42.910183636473995,
            13691.827077475627
        ],
        [
            42.95441398478353,
            14299.572686106832
        ],
        [
            42.996721274470914,
            15595.030430820723
        ],
        [
            43.04095162278045,
            16666.58189867048
        ],
        [
            43.06114373831306,
            16858.50156455402
        ],
        [
            43.13902761251029,
            14635.432101403028
        ],
        [
            43.159219728042906,
            13515.900717082382
        ],
        [
            43.18806560737521,
            12268.422888839379
        ],
        [
            43.23806513155121,
            11020.945060596376
        ],
        [
            43.27317490090447,
            10521.749425104532
        ],
        [
            43.27835078484797,
            10479.526005426125
        ],
        [
            43.28805556724204,
            9712.46721460177
        ],
        [
            43.29129049470673,
            9642.094848471095
        ],
        [
            43.315228957945436,
            9290.233017817722
        ],
        [
            43.32363976935363,
            9058.004209586494
        ],
        [
            43.332697566254765,
            8987.63184345582
        ],
        [
            43.35469507301465,
            8846.88711119447
        ],
        [
            43.47503437470112,
            7657.594123586065
        ],
        [
            43.498972837939824,
            7509.812154711648
        ]
    ],
    "Line2": [
        [
            48.35371427916607,
            9766.559168705211
        ],
        [
            48.386336398665215,
            10348.478728415841
        ],
        [
            48.405222888901555,
            10584.883549548285
        ],
        [
            48.43956196205855,
            11021.323219331261
        ],
        [
            48.4762254438616,
            11685.80065694473
        ],
        [
            48.48794932513403,
            12121.58232526825
        ],
        [
            48.494156085807674,
            12198.484972619459
        ],
        [
            48.603119217633825,
            12839.340367212868
        ],
        [
            48.67139358504388,
            13211.036496077046
        ],
        [
            48.72863371125635,
            13839.074782778587
        ],
        [
            48.76932247567244,
            14441.478853696393
        ],
        [
            48.8121409058119,
            15240.240027233345
        ],
        [
            48.88242344794769,
            16415.313469044097
        ],
        [
            48.91828473183983,
            16940.81489261069
        ],
        [
            48.955525295881685,
            16940.81489261069
        ],
        [
            49.01474143743815,
            16276.784242967908
        ],
        [
            49.103797911974226,
            14403.027530020789
        ],
        [
            49.13621099549213,
            13582.732624941224
        ],
        [
            49.184485800731565,
            12736.803504077921
        ],
        [
            49.218278164399166,
            12352.290267321876
        ],
        [
            49.25413944829132,
            11878.057275322753
        ],
        [
            49.29288793000977,
            11348.652971668493
        ]
    ],
    "Line3": [
        [
            55.49773494165808,
            12289.91699798249
        ],
        [
            55.52613450786198,
            12470.628723032685
        ],
        [
            55.58648358604527,
            13253.712864916863
        ],
        [
            55.662215762589,
            14307.864594376333
        ],
        [
            55.70363179663635,
            14940.355632052018
        ],
        [
            55.78173060369708,
            15949.329430248941
        ],
        [
            55.821963322485935,
            16461.345984557825
        ]
    ],
    "Line4": [
        [
            55.89532886851267,
            14488.57631942653
        ],
        [
            55.91899517368259,
            13283.831485758561
        ],
        [
            55.96159452298844,
            12515.806654295233
        ],
        [
            55.997093980743315,
            12350.154239665888
        ]
    ]
}