3.280900000000000000e+04
3.218000000000000000e+04
3.040700000000000000e+04
2.877300000000000000e+04
2.619100000000000000e+04
2.275700000000000000e+04
1.995300000000000000e+04
1.777100000000000000e+04
1.540100000000000000e+04
1.232400000000000000e+04
1.260800000000000000e+04
1.223300000000000000e+04
1.210900000000000000e+04
1.291500000000000000e+04
1.578500000000000000e+04
1.920700000000000000e+04
2.208700000000000000e+04
2.469300000000000000e+04
2.663500000000000000e+04
2.752300000000000000e+04
2.815400000000000000e+04
2.849800000000000000e+04
2.981600000000000000e+04
3.041700000000000000e+04
3.085400000000000000e+04
