1.926700000000000000e+04
1.902000000000000000e+04
1.874400000000000000e+04
1.815700000000000000e+04
1.702000000000000000e+04
1.368000000000000000e+04
1.148600000000000000e+04
9.703000000000000000e+03
8.250000000000000000e+03
7.261000000000000000e+03
6.785000000000000000e+03
6.931000000000000000e+03
7.017000000000000000e+03
7.391000000000000000e+03
8.095000000000000000e+03
9.878000000000000000e+03
1.243700000000000000e+04
1.421700000000000000e+04
1.539900000000000000e+04
1.631200000000000000e+04
1.698000000000000000e+04
1.761900000000000000e+04
1.825400000000000000e+04
1.882700000000000000e+04
1.920400000000000000e+04
