2.709200000000000000e+04
2.706800000000000000e+04
2.519600000000000000e+04
2.370600000000000000e+04
2.103900000000000000e+04
1.791700000000000000e+04
1.312300000000000000e+04
9.875000000000000000e+03
8.311000000000000000e+03
8.105000000000000000e+03
8.931000000000000000e+03
1.288900000000000000e+04
1.801300000000000000e+04
2.191300000000000000e+04
2.384200000000000000e+04
2.479900000000000000e+04
2.516600000000000000e+04
2.544700000000000000e+04
2.567700000000000000e+04
2.582800000000000000e+04
2.601000000000000000e+04
2.601200000000000000e+04
2.610900000000000000e+04
2.639100000000000000e+04
2.677800000000000000e+04
