2.652400000000000000e+04
2.640600000000000000e+04
2.540400000000000000e+04
2.391200000000000000e+04
2.147700000000000000e+04
1.926400000000000000e+04
1.642100000000000000e+04
1.379600000000000000e+04
1.226800000000000000e+04
1.127000000000000000e+04
1.079500000000000000e+04
1.068400000000000000e+04
1.111100000000000000e+04
1.265200000000000000e+04
1.498500000000000000e+04
1.744200000000000000e+04
2.043600000000000000e+04
2.228500000000000000e+04
2.340300000000000000e+04
2.410900000000000000e+04
2.462700000000000000e+04
2.494900000000000000e+04
2.532000000000000000e+04
2.581900000000000000e+04
2.629300000000000000e+04
