2.706000000000000000e+04
2.273200000000000000e+04
2.073500000000000000e+04
1.713100000000000000e+04
1.408500000000000000e+04
1.138800000000000000e+04
9.589000000000000000e+03
8.362000000000000000e+03
7.824000000000000000e+03
8.599000000000000000e+03
7.907000000000000000e+03
8.832000000000000000e+03
9.581000000000000000e+03
1.205800000000000000e+04
1.363100000000000000e+04
1.511600000000000000e+04
1.646000000000000000e+04
1.784500000000000000e+04
1.958700000000000000e+04
2.142300000000000000e+04
2.266700000000000000e+04
2.374000000000000000e+04
2.445000000000000000e+04
2.505300000000000000e+04
2.541000000000000000e+04
