Namespace(batch_size=64, beta=4, ckpt_dir='checkpoints', ckpt_name='last', cont_capacity=None, dataset='fashion_data', disc_capacity=None, epochs=9000000, experiment_name='beta_VAE_bs_64', gpu_devices=[0, 1], is_beta_VAE=True, latent_spec_cont=10, latent_spec_disc=None, load_expe_name='', load_model_checkpoint=False, lr=0.0001, nb_filter_conv1=32, nb_filter_conv2=32, nb_filter_conv3=64, nb_filter_conv4=64, num_worker=1, print_loss_every=50, record_loss_every=50, save_model=True, save_reconstruction_image=False, save_step=1, verbose=True)
CUDA Visible devices !
creare new diretory experiment: fashion_data/beta_VAE_bs_64
load dataset: fashion_data, with: 60032 train images of shape: (1, 32, 32)
use 2 gpu who named:
GeForce RTX 2080 Ti
GeForce RTX 2080 Ti
DataParallel(
  (module): VAE(
    (img_to_last_conv): Sequential(
      (0): Conv2d(1, 32, kernel_size=(4, 4), stride=(2, 2), padding=(1, 1))
      (1): ReLU()
      (2): Conv2d(32, 64, kernel_size=(4, 4), stride=(2, 2), padding=(1, 1))
      (3): ReLU()
      (4): Conv2d(64, 64, kernel_size=(4, 4), stride=(2, 2), padding=(1, 1))
      (5): ReLU()
    )
    (last_conv_to_continuous_features): Sequential(
      (0): Conv2d(64, 256, kernel_size=(4, 4), stride=(1, 1))
      (1): ReLU()
    )
    (features_to_hidden_continue): Sequential(
      (0): Linear(in_features=256, out_features=20, bias=True)
      (1): ReLU()
    )
    (latent_to_features): Sequential(
      (0): Linear(in_features=10, out_features=256, bias=True)
      (1): ReLU()
    )
    (features_to_img): Sequential(
      (0): ConvTranspose2d(256, 64, kernel_size=(4, 4), stride=(1, 1))
      (1): ReLU()
      (2): ConvTranspose2d(64, 64, kernel_size=(4, 4), stride=(2, 2), padding=(1, 1))
      (3): ReLU()
      (4): ConvTranspose2d(64, 32, kernel_size=(4, 4), stride=(2, 2), padding=(1, 1))
      (5): ReLU()
      (6): ConvTranspose2d(32, 1, kernel_size=(4, 4), stride=(2, 2), padding=(1, 1))
      (7): Sigmoid()
    )
  )
)
The number of parameters of model is 730453
don't use continuous capacity
