Traceback (most recent call last):
  File "main.py", line 154, in <module>
    main(args)
  File "main.py", line 87, in main
    beta=args.beta)
  File "/data1/data/expes/julien.dejasmin/Thesis/Pytorch_CNN_mixt_representation/utils/training.py", line 75, in __init__
    self.load_checkpoint(self.ckpt_name)
  File "/data1/data/expes/julien.dejasmin/Thesis/Pytorch_CNN_mixt_representation/utils/training.py", line 417, in load_checkpoint
    self.mean_epoch_loss = checkpoint['loss']
KeyError: 'loss'
