Namespace(batch_size=64, beta=None, ckpt_dir='checkpoints', ckpt_name='last', cont_capacity=None, dataset='rendered_chairs', disc_capacity=None, epochs=9000, experiment_name='VAE_bs_64_ls_5', gpu_devices=[0, 1], is_beta_VAE=False, latent_spec_cont=5, latent_spec_disc=None, load_expe_name='', load_model_checkpoint=True, lr=1e-05, nb_filter_conv1=32, nb_filter_conv2=32, nb_filter_conv3=64, nb_filter_conv4=64, num_worker=1, print_loss_every=50, record_loss_every=50, save_model=True, save_reconstruction_image=False, save_step=1, verbose=True)
CUDA Visible devices !
load dataset: rendered_chairs, with: 69120 train images of shape: (3, 64, 64)
use 2 gpu who named:
Tesla K80
Tesla K80
DataParallel(
  (module): VAE(
    (img_to_last_conv): Sequential(
      (0): Conv2d(3, 32, kernel_size=(4, 4), stride=(2, 2), padding=(1, 1))
      (1): ReLU()
      (2): Conv2d(32, 32, kernel_size=(4, 4), stride=(2, 2), padding=(1, 1))
      (3): ReLU()
      (4): Conv2d(32, 64, kernel_size=(4, 4), stride=(2, 2), padding=(1, 1))
      (5): ReLU()
      (6): Conv2d(64, 64, kernel_size=(4, 4), stride=(2, 2), padding=(1, 1))
      (7): ReLU()
    )
    (last_conv_to_continuous_features): Sequential(
      (0): Conv2d(64, 256, kernel_size=(4, 4), stride=(1, 1))
      (1): ReLU()
    )
    (features_to_hidden_continue): Sequential(
      (0): Linear(in_features=256, out_features=10, bias=True)
      (1): ReLU()
    )
    (latent_to_features): Sequential(
      (0): Linear(in_features=5, out_features=256, bias=True)
      (1): ReLU()
    )
    (features_to_img): Sequential(
      (0): ConvTranspose2d(256, 64, kernel_size=(4, 4), stride=(1, 1))
      (1): ReLU()
      (2): ConvTranspose2d(64, 64, kernel_size=(4, 4), stride=(2, 2), padding=(1, 1))
      (3): ReLU()
      (4): ConvTranspose2d(64, 32, kernel_size=(4, 4), stride=(2, 2), padding=(1, 1))
      (5): ReLU()
      (6): ConvTranspose2d(32, 32, kernel_size=(4, 4), stride=(2, 2), padding=(1, 1))
      (7): ReLU()
      (8): ConvTranspose2d(32, 3, kernel_size=(4, 4), stride=(2, 2), padding=(1, 1))
      (9): Sigmoid()
    )
  )
)
The number of parameters of model is 761485
don't use continuous capacity
=> loaded checkpoint 'trained_models/rendered_chairs/VAE_bs_64_ls_5/checkpoints/last (iter 469)'
