Namespace(batch_size=64, beta=4, ckpt_dir='checkpoints', ckpt_name='last', cont_capacity=None, dataset='rendered_chairs', disc_capacity=None, epochs=400, experiment_name='beta_VAE_bs_64', gpu_devices=[0, 1], is_beta_VAE=True, latent_spec_cont=10, latent_spec_disc=None, load_expe_name='', load_model_checkpoint=True, lr=1e-05, nb_filter_conv1=32, nb_filter_conv2=32, nb_filter_conv3=64, nb_filter_conv4=64, num_worker=1, print_loss_every=50, record_loss_every=50, save_model=True, save_reconstruction_image=False, save_step=1, verbose=True)
CUDA Visible devices !
load dataset: rendered_chairs, with: 69120 train images of shape: (3, 64, 64)
use 2 gpu who named:
GeForce RTX 2080 Ti
GeForce RTX 2080 Ti
DataParallel(
  (module): VAE(
    (img_to_last_conv): Sequential(
      (0): Conv2d(3, 32, kernel_size=(4, 4), stride=(2, 2), padding=(1, 1))
      (1): ReLU()
      (2): Conv2d(32, 32, kernel_size=(4, 4), stride=(2, 2), padding=(1, 1))
      (3): ReLU()
      (4): Conv2d(32, 64, kernel_size=(4, 4), stride=(2, 2), padding=(1, 1))
      (5): ReLU()
      (6): Conv2d(64, 64, kernel_size=(4, 4), stride=(2, 2), padding=(1, 1))
      (7): ReLU()
    )
    (last_conv_to_continuous_features): Sequential(
      (0): Conv2d(64, 256, kernel_size=(4, 4), stride=(1, 1))
      (1): ReLU()
    )
    (features_to_hidden_continue): Sequential(
      (0): Linear(in_features=256, out_features=20, bias=True)
      (1): ReLU()
    )
    (latent_to_features): Sequential(
      (0): Linear(in_features=10, out_features=256, bias=True)
      (1): ReLU()
    )
    (features_to_img): Sequential(
      (0): ConvTranspose2d(256, 64, kernel_size=(4, 4), stride=(1, 1))
      (1): ReLU()
      (2): ConvTranspose2d(64, 64, kernel_size=(4, 4), stride=(2, 2), padding=(1, 1))
      (3): ReLU()
      (4): ConvTranspose2d(64, 32, kernel_size=(4, 4), stride=(2, 2), padding=(1, 1))
      (5): ReLU()
      (6): ConvTranspose2d(32, 32, kernel_size=(4, 4), stride=(2, 2), padding=(1, 1))
      (7): ReLU()
      (8): ConvTranspose2d(32, 3, kernel_size=(4, 4), stride=(2, 2), padding=(1, 1))
      (9): Sigmoid()
    )
  )
)
The number of parameters of model is 765335
don't use continuous capacity
=> loaded checkpoint 'trained_models/rendered_chairs/beta_VAE_bs_64/checkpoints/last (iter 768)'
0/69092	Loss: 151.940
3200/69092	Loss: 151.123
6400/69092	Loss: 152.240
9600/69092	Loss: 154.456
12800/69092	Loss: 152.151
16000/69092	Loss: 150.843
19200/69092	Loss: 151.704
22400/69092	Loss: 151.679
25600/69092	Loss: 150.622
28800/69092	Loss: 153.092
32000/69092	Loss: 153.267
35200/69092	Loss: 150.582
38400/69092	Loss: 153.799
41600/69092	Loss: 151.305
44800/69092	Loss: 151.560
48000/69092	Loss: 150.741
51200/69092	Loss: 151.885
54400/69092	Loss: 150.161
57600/69092	Loss: 152.044
60800/69092	Loss: 150.668
64000/69092	Loss: 150.622
67200/69092	Loss: 150.227
Training time 0:10:39.669089
Epoch: 1 Average loss: 151.68
=> saved checkpoint 'trained_models/rendered_chairs/beta_VAE_bs_64/checkpoints/last' (iter 769)
0/69092	Loss: 159.826
3200/69092	Loss: 155.528
6400/69092	Loss: 153.084
9600/69092	Loss: 152.096
12800/69092	Loss: 152.363
16000/69092	Loss: 150.556
19200/69092	Loss: 148.058
22400/69092	Loss: 152.518
25600/69092	Loss: 151.159
28800/69092	Loss: 153.739
32000/69092	Loss: 149.939
35200/69092	Loss: 152.543
38400/69092	Loss: 151.002
41600/69092	Loss: 151.378
44800/69092	Loss: 149.524
48000/69092	Loss: 152.165
51200/69092	Loss: 151.533
54400/69092	Loss: 148.544
57600/69092	Loss: 152.467
60800/69092	Loss: 153.726
64000/69092	Loss: 151.344
67200/69092	Loss: 154.598
Training time 0:10:34.220042
Epoch: 2 Average loss: 151.83
=> saved checkpoint 'trained_models/rendered_chairs/beta_VAE_bs_64/checkpoints/last' (iter 770)
0/69092	Loss: 155.574
3200/69092	Loss: 151.047
6400/69092	Loss: 149.378
9600/69092	Loss: 151.613
12800/69092	Loss: 152.097
16000/69092	Loss: 152.221
19200/69092	Loss: 151.504
22400/69092	Loss: 152.222
25600/69092	Loss: 152.531
28800/69092	Loss: 150.282
32000/69092	Loss: 151.100
35200/69092	Loss: 153.495
38400/69092	Loss: 149.776
41600/69092	Loss: 150.461
44800/69092	Loss: 152.533
48000/69092	Loss: 153.336
51200/69092	Loss: 153.742
54400/69092	Loss: 152.341
57600/69092	Loss: 153.011
60800/69092	Loss: 153.359
64000/69092	Loss: 151.765
67200/69092	Loss: 149.833
Training time 0:10:18.548337
Epoch: 3 Average loss: 151.74
=> saved checkpoint 'trained_models/rendered_chairs/beta_VAE_bs_64/checkpoints/last' (iter 771)
0/69092	Loss: 149.541
3200/69092	Loss: 150.722
6400/69092	Loss: 152.327
9600/69092	Loss: 148.762
12800/69092	Loss: 150.084
16000/69092	Loss: 151.317
19200/69092	Loss: 151.855
22400/69092	Loss: 151.256
25600/69092	Loss: 153.280
28800/69092	Loss: 152.067
32000/69092	Loss: 154.260
35200/69092	Loss: 147.713
38400/69092	Loss: 152.622
41600/69092	Loss: 152.811
44800/69092	Loss: 151.757
48000/69092	Loss: 152.970
51200/69092	Loss: 150.973
54400/69092	Loss: 150.648
57600/69092	Loss: 152.005
60800/69092	Loss: 152.170
64000/69092	Loss: 152.880
67200/69092	Loss: 152.945
Training time 0:10:46.082361
Epoch: 4 Average loss: 151.68
=> saved checkpoint 'trained_models/rendered_chairs/beta_VAE_bs_64/checkpoints/last' (iter 772)
0/69092	Loss: 128.234
3200/69092	Loss: 151.711
6400/69092	Loss: 151.919
9600/69092	Loss: 150.830
12800/69092	Loss: 153.890
16000/69092	Loss: 150.860
19200/69092	Loss: 153.058
22400/69092	Loss: 153.962
25600/69092	Loss: 151.795
28800/69092	Loss: 150.298
32000/69092	Loss: 153.955
35200/69092	Loss: 151.321
38400/69092	Loss: 150.578
41600/69092	Loss: 151.991
44800/69092	Loss: 151.477
48000/69092	Loss: 150.079
51200/69092	Loss: 151.311
54400/69092	Loss: 150.190
57600/69092	Loss: 153.374
60800/69092	Loss: 154.199
64000/69092	Loss: 152.083
67200/69092	Loss: 152.334
Training time 0:10:26.629045
Epoch: 5 Average loss: 151.90
=> saved checkpoint 'trained_models/rendered_chairs/beta_VAE_bs_64/checkpoints/last' (iter 773)
0/69092	Loss: 151.981
3200/69092	Loss: 152.328
6400/69092	Loss: 153.386
9600/69092	Loss: 150.931
12800/69092	Loss: 152.916
16000/69092	Loss: 150.853
19200/69092	Loss: 155.195
22400/69092	Loss: 150.530
25600/69092	Loss: 150.215
28800/69092	Loss: 149.994
32000/69092	Loss: 151.922
35200/69092	Loss: 150.617
38400/69092	Loss: 148.687
41600/69092	Loss: 149.949
44800/69092	Loss: 150.374
48000/69092	Loss: 153.431
51200/69092	Loss: 152.256
54400/69092	Loss: 154.912
57600/69092	Loss: 151.775
60800/69092	Loss: 148.809
64000/69092	Loss: 152.993
67200/69092	Loss: 152.113
Training time 0:10:55.747236
Epoch: 6 Average loss: 151.71
=> saved checkpoint 'trained_models/rendered_chairs/beta_VAE_bs_64/checkpoints/last' (iter 774)
0/69092	Loss: 161.032
3200/69092	Loss: 150.489
6400/69092	Loss: 151.788
9600/69092	Loss: 151.782
12800/69092	Loss: 150.235
16000/69092	Loss: 154.594
19200/69092	Loss: 150.676
22400/69092	Loss: 150.407
25600/69092	Loss: 151.105
28800/69092	Loss: 152.824
32000/69092	Loss: 152.237
35200/69092	Loss: 153.190
38400/69092	Loss: 150.788
41600/69092	Loss: 149.924
44800/69092	Loss: 152.878
48000/69092	Loss: 151.703
51200/69092	Loss: 150.422
54400/69092	Loss: 151.719
57600/69092	Loss: 152.224
60800/69092	Loss: 153.809
64000/69092	Loss: 149.802
67200/69092	Loss: 150.667
Training time 0:10:53.402046
Epoch: 7 Average loss: 151.65
=> saved checkpoint 'trained_models/rendered_chairs/beta_VAE_bs_64/checkpoints/last' (iter 775)
0/69092	Loss: 150.086
3200/69092	Loss: 153.433
6400/69092	Loss: 150.415
9600/69092	Loss: 153.438
12800/69092	Loss: 149.193
16000/69092	Loss: 151.045
19200/69092	Loss: 148.747
22400/69092	Loss: 151.117
25600/69092	Loss: 150.434
28800/69092	Loss: 150.123
32000/69092	Loss: 152.996
35200/69092	Loss: 152.099
38400/69092	Loss: 151.190
41600/69092	Loss: 152.928
44800/69092	Loss: 152.553
48000/69092	Loss: 151.283
51200/69092	Loss: 152.039
54400/69092	Loss: 151.448
57600/69092	Loss: 151.806
60800/69092	Loss: 150.245
64000/69092	Loss: 152.300
67200/69092	Loss: 152.545
Training time 0:10:16.941117
Epoch: 8 Average loss: 151.50
=> saved checkpoint 'trained_models/rendered_chairs/beta_VAE_bs_64/checkpoints/last' (iter 776)
0/69092	Loss: 142.755
3200/69092	Loss: 150.657
6400/69092	Loss: 151.619
9600/69092	Loss: 152.357
12800/69092	Loss: 151.392
16000/69092	Loss: 151.836
19200/69092	Loss: 152.021
22400/69092	Loss: 153.780
25600/69092	Loss: 151.759
28800/69092	Loss: 151.016
32000/69092	Loss: 150.397
35200/69092	Loss: 151.324
38400/69092	Loss: 152.198
41600/69092	Loss: 153.828
44800/69092	Loss: 150.664
48000/69092	Loss: 150.837
51200/69092	Loss: 154.898
54400/69092	Loss: 151.182
57600/69092	Loss: 148.820
60800/69092	Loss: 152.543
64000/69092	Loss: 151.735
67200/69092	Loss: 148.089
Training time 0:10:28.361734
Epoch: 9 Average loss: 151.61
=> saved checkpoint 'trained_models/rendered_chairs/beta_VAE_bs_64/checkpoints/last' (iter 777)
0/69092	Loss: 142.051
3200/69092	Loss: 148.852
6400/69092	Loss: 148.513
9600/69092	Loss: 152.910
12800/69092	Loss: 150.108
16000/69092	Loss: 154.028
19200/69092	Loss: 150.451
22400/69092	Loss: 153.521
25600/69092	Loss: 147.976
28800/69092	Loss: 148.766
32000/69092	Loss: 149.970
35200/69092	Loss: 150.618
38400/69092	Loss: 150.971
41600/69092	Loss: 150.817
44800/69092	Loss: 154.553
48000/69092	Loss: 155.033
51200/69092	Loss: 149.239
54400/69092	Loss: 152.046
57600/69092	Loss: 153.721
60800/69092	Loss: 151.871
64000/69092	Loss: 154.558
67200/69092	Loss: 150.223
Training time 0:10:23.290199
Epoch: 10 Average loss: 151.46
=> saved checkpoint 'trained_models/rendered_chairs/beta_VAE_bs_64/checkpoints/last' (iter 778)
0/69092	Loss: 149.057
3200/69092	Loss: 150.138
6400/69092	Loss: 150.666
9600/69092	Loss: 151.855
12800/69092	Loss: 151.778
16000/69092	Loss: 151.908
19200/69092	Loss: 151.032
22400/69092	Loss: 152.961
25600/69092	Loss: 154.912
28800/69092	Loss: 151.573
32000/69092	Loss: 154.543
35200/69092	Loss: 151.433
38400/69092	Loss: 149.579
41600/69092	Loss: 150.587
44800/69092	Loss: 152.174
48000/69092	Loss: 149.528
51200/69092	Loss: 150.743
54400/69092	Loss: 152.121
57600/69092	Loss: 151.739
60800/69092	Loss: 149.955
64000/69092	Loss: 150.658
67200/69092	Loss: 155.248
Training time 0:10:02.301303
Epoch: 11 Average loss: 151.73
=> saved checkpoint 'trained_models/rendered_chairs/beta_VAE_bs_64/checkpoints/last' (iter 779)
0/69092	Loss: 152.842
3200/69092	Loss: 152.468
6400/69092	Loss: 149.136
9600/69092	Loss: 152.618
12800/69092	Loss: 150.399
16000/69092	Loss: 153.064
19200/69092	Loss: 151.608
22400/69092	Loss: 152.280
25600/69092	Loss: 150.410
28800/69092	Loss: 152.462
32000/69092	Loss: 149.632
35200/69092	Loss: 151.900
38400/69092	Loss: 148.866
41600/69092	Loss: 153.946
44800/69092	Loss: 153.180
48000/69092	Loss: 152.256
51200/69092	Loss: 150.869
54400/69092	Loss: 151.987
57600/69092	Loss: 151.927
60800/69092	Loss: 150.315
64000/69092	Loss: 152.272
67200/69092	Loss: 150.027
Training time 0:10:35.921149
Epoch: 12 Average loss: 151.59
=> saved checkpoint 'trained_models/rendered_chairs/beta_VAE_bs_64/checkpoints/last' (iter 780)
0/69092	Loss: 155.203
3200/69092	Loss: 149.290
6400/69092	Loss: 150.722
9600/69092	Loss: 150.173
12800/69092	Loss: 151.060
16000/69092	Loss: 152.570
19200/69092	Loss: 156.369
22400/69092	Loss: 151.513
25600/69092	Loss: 150.945
28800/69092	Loss: 150.378
32000/69092	Loss: 153.038
35200/69092	Loss: 154.230
38400/69092	Loss: 153.176
41600/69092	Loss: 148.850
44800/69092	Loss: 154.538
48000/69092	Loss: 151.359
51200/69092	Loss: 151.464
54400/69092	Loss: 151.170
57600/69092	Loss: 149.252
60800/69092	Loss: 151.042
64000/69092	Loss: 153.423
67200/69092	Loss: 149.422
Training time 0:10:31.361427
Epoch: 13 Average loss: 151.71
=> saved checkpoint 'trained_models/rendered_chairs/beta_VAE_bs_64/checkpoints/last' (iter 781)
0/69092	Loss: 146.776
3200/69092	Loss: 152.727
6400/69092	Loss: 154.581
9600/69092	Loss: 151.684
12800/69092	Loss: 149.094
16000/69092	Loss: 151.217
19200/69092	Loss: 150.166
22400/69092	Loss: 152.380
25600/69092	Loss: 151.874
28800/69092	Loss: 153.713
32000/69092	Loss: 152.922
35200/69092	Loss: 154.464
38400/69092	Loss: 150.433
41600/69092	Loss: 149.945
44800/69092	Loss: 152.313
48000/69092	Loss: 152.333
51200/69092	Loss: 153.386
54400/69092	Loss: 152.386
57600/69092	Loss: 150.411
60800/69092	Loss: 151.260
64000/69092	Loss: 153.093
67200/69092	Loss: 147.063
Training time 0:10:44.034995
Epoch: 14 Average loss: 151.70
=> saved checkpoint 'trained_models/rendered_chairs/beta_VAE_bs_64/checkpoints/last' (iter 782)
0/69092	Loss: 133.995
3200/69092	Loss: 153.631
6400/69092	Loss: 152.677
9600/69092	Loss: 148.565
12800/69092	Loss: 152.216
16000/69092	Loss: 153.812
19200/69092	Loss: 153.412
22400/69092	Loss: 149.740
25600/69092	Loss: 152.386
28800/69092	Loss: 152.186
32000/69092	Loss: 153.078
35200/69092	Loss: 151.331
38400/69092	Loss: 151.224
41600/69092	Loss: 151.745
44800/69092	Loss: 150.595
48000/69092	Loss: 149.903
51200/69092	Loss: 151.151
54400/69092	Loss: 152.719
57600/69092	Loss: 147.748
60800/69092	Loss: 147.822
64000/69092	Loss: 151.649
67200/69092	Loss: 152.350
Training time 0:10:26.490651
Epoch: 15 Average loss: 151.37
=> saved checkpoint 'trained_models/rendered_chairs/beta_VAE_bs_64/checkpoints/last' (iter 783)
0/69092	Loss: 165.291
3200/69092	Loss: 149.069
6400/69092	Loss: 151.144
9600/69092	Loss: 149.362
12800/69092	Loss: 152.472
16000/69092	Loss: 150.844
19200/69092	Loss: 150.975
22400/69092	Loss: 150.666
25600/69092	Loss: 149.360
28800/69092	Loss: 150.892
32000/69092	Loss: 151.124
35200/69092	Loss: 152.196
38400/69092	Loss: 153.774
41600/69092	Loss: 152.521
44800/69092	Loss: 151.684
48000/69092	Loss: 153.329
51200/69092	Loss: 150.415
54400/69092	Loss: 151.445
57600/69092	Loss: 154.007
60800/69092	Loss: 150.657
64000/69092	Loss: 152.308
67200/69092	Loss: 150.726
Training time 0:11:06.137906
Epoch: 16 Average loss: 151.42
=> saved checkpoint 'trained_models/rendered_chairs/beta_VAE_bs_64/checkpoints/last' (iter 784)
0/69092	Loss: 144.484
3200/69092	Loss: 151.458
6400/69092	Loss: 152.609
9600/69092	Loss: 152.940
12800/69092	Loss: 153.378
16000/69092	Loss: 152.672
19200/69092	Loss: 152.431
22400/69092	Loss: 151.115
25600/69092	Loss: 151.894
28800/69092	Loss: 150.751
32000/69092	Loss: 152.050
35200/69092	Loss: 150.673
38400/69092	Loss: 151.820
41600/69092	Loss: 152.699
44800/69092	Loss: 150.842
48000/69092	Loss: 152.601
51200/69092	Loss: 148.367
54400/69092	Loss: 151.450
57600/69092	Loss: 151.025
60800/69092	Loss: 150.256
64000/69092	Loss: 153.945
67200/69092	Loss: 150.735
Training time 0:10:30.921815
Epoch: 17 Average loss: 151.67
=> saved checkpoint 'trained_models/rendered_chairs/beta_VAE_bs_64/checkpoints/last' (iter 785)
0/69092	Loss: 149.105
3200/69092	Loss: 154.167
6400/69092	Loss: 150.111
9600/69092	Loss: 150.985
12800/69092	Loss: 151.978
16000/69092	Loss: 151.739
19200/69092	Loss: 153.227
22400/69092	Loss: 150.762
25600/69092	Loss: 153.572
28800/69092	Loss: 151.868
32000/69092	Loss: 152.932
35200/69092	Loss: 150.313
38400/69092	Loss: 149.599
41600/69092	Loss: 151.857
44800/69092	Loss: 152.196
48000/69092	Loss: 151.910
51200/69092	Loss: 149.218
54400/69092	Loss: 151.897
57600/69092	Loss: 152.954
60800/69092	Loss: 149.504
64000/69092	Loss: 152.771
67200/69092	Loss: 151.289
Training time 0:10:48.111194
Epoch: 18 Average loss: 151.65
=> saved checkpoint 'trained_models/rendered_chairs/beta_VAE_bs_64/checkpoints/last' (iter 786)
0/69092	Loss: 156.353
3200/69092	Loss: 151.484
6400/69092	Loss: 152.173
9600/69092	Loss: 150.284
12800/69092	Loss: 152.109
16000/69092	Loss: 153.112
19200/69092	Loss: 155.199
22400/69092	Loss: 150.800
25600/69092	Loss: 149.949
28800/69092	Loss: 151.230
32000/69092	Loss: 149.613
35200/69092	Loss: 152.457
38400/69092	Loss: 152.412
41600/69092	Loss: 151.116
44800/69092	Loss: 153.088
48000/69092	Loss: 151.320
51200/69092	Loss: 149.919
54400/69092	Loss: 150.432
57600/69092	Loss: 153.685
60800/69092	Loss: 151.287
64000/69092	Loss: 150.028
67200/69092	Loss: 150.473
Training time 0:10:12.069793
Epoch: 19 Average loss: 151.59
=> saved checkpoint 'trained_models/rendered_chairs/beta_VAE_bs_64/checkpoints/last' (iter 787)
0/69092	Loss: 139.116
3200/69092	Loss: 152.967
6400/69092	Loss: 148.803
9600/69092	Loss: 151.478
12800/69092	Loss: 151.373
16000/69092	Loss: 150.007
19200/69092	Loss: 153.504
22400/69092	Loss: 151.458
25600/69092	Loss: 149.068
28800/69092	Loss: 153.966
32000/69092	Loss: 153.562
35200/69092	Loss: 148.962
38400/69092	Loss: 153.138
41600/69092	Loss: 154.136
44800/69092	Loss: 149.912
48000/69092	Loss: 151.040
51200/69092	Loss: 150.974
54400/69092	Loss: 152.708
57600/69092	Loss: 150.486
60800/69092	Loss: 153.213
64000/69092	Loss: 151.913
67200/69092	Loss: 152.005
Training time 0:10:20.811275
Epoch: 20 Average loss: 151.61
=> saved checkpoint 'trained_models/rendered_chairs/beta_VAE_bs_64/checkpoints/last' (iter 788)
0/69092	Loss: 147.916
3200/69092	Loss: 149.391
6400/69092	Loss: 150.723
9600/69092	Loss: 152.174
12800/69092	Loss: 151.629
16000/69092	Loss: 153.353
19200/69092	Loss: 151.887
22400/69092	Loss: 150.459
25600/69092	Loss: 152.292
28800/69092	Loss: 151.080
32000/69092	Loss: 154.926
35200/69092	Loss: 150.486
38400/69092	Loss: 151.631
41600/69092	Loss: 150.604
44800/69092	Loss: 151.841
48000/69092	Loss: 151.894
51200/69092	Loss: 149.205
54400/69092	Loss: 151.854
57600/69092	Loss: 150.251
60800/69092	Loss: 149.714
64000/69092	Loss: 152.077
67200/69092	Loss: 152.032
Training time 0:10:11.770670
Epoch: 21 Average loss: 151.42
=> saved checkpoint 'trained_models/rendered_chairs/beta_VAE_bs_64/checkpoints/last' (iter 789)
0/69092	Loss: 164.078
3200/69092	Loss: 151.525
6400/69092	Loss: 153.988
9600/69092	Loss: 149.142
12800/69092	Loss: 151.592
16000/69092	Loss: 151.993
19200/69092	Loss: 150.118
22400/69092	Loss: 150.498
25600/69092	Loss: 151.343
28800/69092	Loss: 153.764
32000/69092	Loss: 150.852
35200/69092	Loss: 152.486
38400/69092	Loss: 152.394
41600/69092	Loss: 150.734
44800/69092	Loss: 151.284
48000/69092	Loss: 152.597
51200/69092	Loss: 150.589
54400/69092	Loss: 150.206
57600/69092	Loss: 151.417
60800/69092	Loss: 151.005
64000/69092	Loss: 153.224
67200/69092	Loss: 153.169
Training time 0:10:33.472371
Epoch: 22 Average loss: 151.71
=> saved checkpoint 'trained_models/rendered_chairs/beta_VAE_bs_64/checkpoints/last' (iter 790)
0/69092	Loss: 145.559
3200/69092	Loss: 150.164
6400/69092	Loss: 151.514
9600/69092	Loss: 151.173
12800/69092	Loss: 152.271
16000/69092	Loss: 153.139
19200/69092	Loss: 150.887
22400/69092	Loss: 150.752
25600/69092	Loss: 152.485
28800/69092	Loss: 151.779
32000/69092	Loss: 151.846
35200/69092	Loss: 152.138
38400/69092	Loss: 154.723
41600/69092	Loss: 152.015
44800/69092	Loss: 152.515
48000/69092	Loss: 151.063
51200/69092	Loss: 154.114
54400/69092	Loss: 151.833
57600/69092	Loss: 148.895
60800/69092	Loss: 149.349
64000/69092	Loss: 151.584
67200/69092	Loss: 148.678
Training time 0:09:53.632891
Epoch: 23 Average loss: 151.62
=> saved checkpoint 'trained_models/rendered_chairs/beta_VAE_bs_64/checkpoints/last' (iter 791)
0/69092	Loss: 135.151
3200/69092	Loss: 150.026
6400/69092	Loss: 149.487
9600/69092	Loss: 152.590
12800/69092	Loss: 150.973
16000/69092	Loss: 150.229
19200/69092	Loss: 148.999
22400/69092	Loss: 147.100
25600/69092	Loss: 153.667
28800/69092	Loss: 152.520
32000/69092	Loss: 152.234
35200/69092	Loss: 153.836
38400/69092	Loss: 150.599
41600/69092	Loss: 153.598
44800/69092	Loss: 153.442
48000/69092	Loss: 151.034
51200/69092	Loss: 151.636
54400/69092	Loss: 150.366
57600/69092	Loss: 152.079
60800/69092	Loss: 155.366
64000/69092	Loss: 152.208
67200/69092	Loss: 154.034
Training time 0:11:00.856151
Epoch: 24 Average loss: 151.67
=> saved checkpoint 'trained_models/rendered_chairs/beta_VAE_bs_64/checkpoints/last' (iter 792)
0/69092	Loss: 148.839
3200/69092	Loss: 150.547
6400/69092	Loss: 152.331
9600/69092	Loss: 150.041
12800/69092	Loss: 149.418
16000/69092	Loss: 148.857
19200/69092	Loss: 151.414
22400/69092	Loss: 152.656
25600/69092	Loss: 150.780
28800/69092	Loss: 151.046
32000/69092	Loss: 152.391
35200/69092	Loss: 152.347
38400/69092	Loss: 151.635
41600/69092	Loss: 151.890
44800/69092	Loss: 154.596
48000/69092	Loss: 149.873
51200/69092	Loss: 150.918
54400/69092	Loss: 151.772
57600/69092	Loss: 152.508
60800/69092	Loss: 151.179
64000/69092	Loss: 152.463
67200/69092	Loss: 152.157
Training time 0:11:03.146948
Epoch: 25 Average loss: 151.51
=> saved checkpoint 'trained_models/rendered_chairs/beta_VAE_bs_64/checkpoints/last' (iter 793)
0/69092	Loss: 161.401
3200/69092	Loss: 149.583
6400/69092	Loss: 153.927
9600/69092	Loss: 151.978
12800/69092	Loss: 148.130
16000/69092	Loss: 150.961
19200/69092	Loss: 152.851
22400/69092	Loss: 152.051
25600/69092	Loss: 151.571
28800/69092	Loss: 154.100
32000/69092	Loss: 151.094
35200/69092	Loss: 155.622
38400/69092	Loss: 149.063
41600/69092	Loss: 149.194
44800/69092	Loss: 152.503
48000/69092	Loss: 151.265
51200/69092	Loss: 150.613
54400/69092	Loss: 150.716
57600/69092	Loss: 151.582
60800/69092	Loss: 152.828
64000/69092	Loss: 152.323
67200/69092	Loss: 151.812
Training time 0:10:32.774337
Epoch: 26 Average loss: 151.67
=> saved checkpoint 'trained_models/rendered_chairs/beta_VAE_bs_64/checkpoints/last' (iter 794)
0/69092	Loss: 161.924
3200/69092	Loss: 150.709
6400/69092	Loss: 148.974
9600/69092	Loss: 150.561
12800/69092	Loss: 151.155
16000/69092	Loss: 153.755
19200/69092	Loss: 153.586
22400/69092	Loss: 152.655
25600/69092	Loss: 152.570
28800/69092	Loss: 153.050
32000/69092	Loss: 152.711
35200/69092	Loss: 151.796
38400/69092	Loss: 151.566
41600/69092	Loss: 151.215
44800/69092	Loss: 151.070
48000/69092	Loss: 152.138
51200/69092	Loss: 151.314
54400/69092	Loss: 151.994
57600/69092	Loss: 149.981
60800/69092	Loss: 149.437
64000/69092	Loss: 149.455
67200/69092	Loss: 154.203
Training time 0:10:02.543376
Epoch: 27 Average loss: 151.57
=> saved checkpoint 'trained_models/rendered_chairs/beta_VAE_bs_64/checkpoints/last' (iter 795)
0/69092	Loss: 144.700
3200/69092	Loss: 150.546
6400/69092	Loss: 151.705
9600/69092	Loss: 151.077
12800/69092	Loss: 151.864
16000/69092	Loss: 151.946
19200/69092	Loss: 150.677
22400/69092	Loss: 150.169
25600/69092	Loss: 148.889
28800/69092	Loss: 154.708
32000/69092	Loss: 151.943
35200/69092	Loss: 152.121
38400/69092	Loss: 152.201
41600/69092	Loss: 152.669
44800/69092	Loss: 152.839
48000/69092	Loss: 154.190
51200/69092	Loss: 150.046
54400/69092	Loss: 150.808
57600/69092	Loss: 153.924
60800/69092	Loss: 149.571
64000/69092	Loss: 151.539
67200/69092	Loss: 149.816
Training time 0:10:12.554327
Epoch: 28 Average loss: 151.63
=> saved checkpoint 'trained_models/rendered_chairs/beta_VAE_bs_64/checkpoints/last' (iter 796)
0/69092	Loss: 159.629
3200/69092	Loss: 151.190
6400/69092	Loss: 152.045
9600/69092	Loss: 151.655
12800/69092	Loss: 149.766
16000/69092	Loss: 150.414
19200/69092	Loss: 151.565
22400/69092	Loss: 149.433
25600/69092	Loss: 154.225
28800/69092	Loss: 153.969
32000/69092	Loss: 148.928
35200/69092	Loss: 150.995
38400/69092	Loss: 150.903
41600/69092	Loss: 149.831
44800/69092	Loss: 152.827
48000/69092	Loss: 150.649
51200/69092	Loss: 152.855
54400/69092	Loss: 152.803
57600/69092	Loss: 151.228
60800/69092	Loss: 151.632
64000/69092	Loss: 151.694
67200/69092	Loss: 151.580
Training time 0:10:29.073350
Epoch: 29 Average loss: 151.49
=> saved checkpoint 'trained_models/rendered_chairs/beta_VAE_bs_64/checkpoints/last' (iter 797)
0/69092	Loss: 153.443
3200/69092	Loss: 152.324
6400/69092	Loss: 150.465
9600/69092	Loss: 149.903
12800/69092	Loss: 152.710
16000/69092	Loss: 149.294
19200/69092	Loss: 150.507
22400/69092	Loss: 150.007
25600/69092	Loss: 151.076
28800/69092	Loss: 150.543
32000/69092	Loss: 152.231
35200/69092	Loss: 151.692
