%!PS-Adobe-2.0 EPSF-2.0
%%Title: dec_worst_case
%%Creator: LEMON, graphToEps()
%%CreationDate: Sat Dec  5 17:45:14 2020
%%BoundingBox: -77 -71 77 71
%%EndComments
/lb { setlinewidth setrgbcolor newpath moveto
      4 2 roll 1 index 1 index curveto stroke } bind def
/l { setlinewidth setrgbcolor newpath moveto lineto stroke } bind def
/c { newpath dup 3 index add 2 index moveto 0 360 arc closepath } bind def
/sq { newpath 2 index 1 index add 2 index 2 index add moveto
      2 index 1 index sub 2 index 2 index add lineto
      2 index 1 index sub 2 index 2 index sub lineto
      2 index 1 index add 2 index 2 index sub lineto
      closepath pop pop pop} bind def
/di { newpath 2 index 1 index add 2 index moveto
      2 index             2 index 2 index add lineto
      2 index 1 index sub 2 index             lineto
      2 index             2 index 2 index sub lineto
      closepath pop pop pop} bind def
/nc { 0 0 0 setrgbcolor 5 index 5 index 5 index c fill
     setrgbcolor 1.1 div c fill
   } bind def
/nsq { 0 0 0 setrgbcolor 5 index 5 index 5 index sq fill
     setrgbcolor 1.1 div sq fill
   } bind def
/ndi { 0 0 0 setrgbcolor 5 index 5 index 5 index di fill
     setrgbcolor 1.1 div di fill
   } bind def
/nfemale { 0 0 0 setrgbcolor 3 index 0.0909091 1.5 mul mul setlinewidth
  newpath 5 index 5 index moveto 5 index 5 index 5 index 3.01 mul sub
  lineto 5 index 4 index .7 mul sub 5 index 5 index 2.2 mul sub moveto
  5 index 4 index .7 mul add 5 index 5 index 2.2 mul sub lineto stroke
  5 index 5 index 5 index c fill
  setrgbcolor 1.1 div c fill
  } bind def
/nmale {
  0 0 0 setrgbcolor 3 index 0.0909091 1.5 mul mul setlinewidth
  newpath 5 index 5 index moveto
  5 index 4 index 1 mul 1.5 mul add
  5 index 5 index 3 sqrt 1.5 mul mul add
  1 index 1 index lineto
  1 index 1 index 7 index sub moveto
  1 index 1 index lineto
  exch 5 index 3 sqrt .5 mul mul sub exch 5 index .5 mul sub lineto
  stroke
  5 index 5 index 5 index c fill
  setrgbcolor 1.1 div c fill
  } bind def
/arrl 0.2 def
/arrw 0.0524974 def
/lrl { 2 index mul exch 2 index mul exch rlineto pop} bind def
/arr { setrgbcolor /y1 exch def /x1 exch def /dy exch def /dx exch def
       /w exch def /len exch def
       newpath x1 dy w 2 div mul add y1 dx w 2 div mul sub moveto
       len w sub arrl sub dx dy lrl
       arrw dy dx neg lrl
       dx arrl w add mul dy w 2 div arrw add mul sub
       dy arrl w add mul dx w 2 div arrw add mul add rlineto
       dx arrl w add mul neg dy w 2 div arrw add mul sub
       dy arrl w add mul neg dx w 2 div arrw add mul add rlineto
       arrw dy dx neg lrl
       len w sub arrl sub neg dx dy lrl
       closepath fill } bind def
/cshow { 2 index 2 index moveto dup stringwidth pop
         neg 2 div fosi .35 mul neg rmoveto show pop pop} def

gsave
10 dup scale
%Arcs:
gsave
4 0 5 0 1 0 0 0.0874956 l
4 0 3 0 1 0 0 0.0874956 l
3 0 4 0 1 0 0 0.0874956 l
3 0 2 0 1 0 0 0.0874956 l
2 0 3 0 1 0 0 0.0874956 l
2 0 1 0 1 0 0 0.0874956 l
1 0 2 0 1 0 0 0.0874956 l
1 0 0 0 1 0 0 0.0874956 l
2.5 -4.33013 0 0 1 0 0 0.0874956 l
-2.5 -4.33013 0 0 1 0 0 0.0874956 l
-5 6.12323e-16 0 0 1 0 0 0.0874956 l
-2.5 4.33013 0 0 1 0 0 0.0874956 l
2.5 4.33013 0 0 1 0 0 0.0874956 l
5 0 4 0 1 0 0 0.0874956 l
0 0 1 0 1 0 0 0.0874956 l
0 0 2.5 -4.33013 1 0 0 0.0874956 l
0 0 -2.5 -4.33013 1 0 0 0.0874956 l
0 0 -5 6.12323e-16 1 0 0 0.0874956 l
0 0 -2.5 4.33013 1 0 0 0.0874956 l
0 0 2.5 4.33013 1 0 0 0.0874956 l
grestore
%Nodes:
gsave
4 0 0.138164 0 0 0 nc
3 0 0.138164 0 0 0 nc
2 0 0.138164 0 0 0 nc
1 0 0.138164 0 0 0 nc
2.5 -4.33013 0.699965 1 1 1 nc
-2.5 -4.33013 0.699965 1 1 1 nc
-5 6.12323e-16 0.699965 1 1 1 nc
-2.5 4.33013 0.699965 1 1 1 nc
2.5 4.33013 0.699965 1 1 1 nc
5 0 0.7 1 1 1 nc
0 0 0.699965 1 1 1 nc
grestore
%Node texts:
gsave
/fosi 0.749963 def
(Helvetica) findfont fosi scalefont setfont
0 0 0 setrgbcolor
4 0 () cshow
0 0 0 setrgbcolor
3 0 () cshow
0 0 0 setrgbcolor
2 0 () cshow
0 0 0 setrgbcolor
1 0 () cshow
0 0 0 setrgbcolor
2.5 -4.33013 (6) cshow
0 0 0 setrgbcolor
-2.5 -4.33013 (5) cshow
0 0 0 setrgbcolor
-5 6.12323e-16 (4) cshow
0 0 0 setrgbcolor
-2.5 4.33013 (3) cshow
0 0 0 setrgbcolor
2.5 4.33013 (2) cshow
0 0 0 setrgbcolor
5 0 (1) cshow
0 0 0 setrgbcolor
0 0 (0) cshow
grestore
grestore
showpage
