\relax 
\bbl@cs{beforestart}
\catcode `:\active 
\catcode `;\active 
\catcode `!\active 
\catcode `?\active 
\babel@aux{french}{}
\@writefile{toc}{\contentsline {section}{\numberline {1}Introduction}{1}\protected@file@percent }
\@writefile{toc}{\contentsline {section}{\numberline {2}HTML}{1}\protected@file@percent }
\@writefile{toc}{\contentsline {section}{\numberline {3}Javascript}{1}\protected@file@percent }
\@writefile{toc}{\contentsline {section}{\numberline {4}Le joueur devine}{2}\protected@file@percent }
\@writefile{toc}{\contentsline {section}{\numberline {5}L'ordinateur devine}{2}\protected@file@percent }
