\relax 
\bbl@cs{beforestart}
\catcode `:\active 
\catcode `;\active 
\catcode `!\active 
\catcode `?\active 
\babel@aux{french}{}
\@writefile{toc}{\contentsline {section}{\numberline {1}Introduction}{1}\protected@file@percent }
\@writefile{toc}{\contentsline {section}{\numberline {2}Gestion des données}{1}\protected@file@percent }
\@writefile{toc}{\contentsline {section}{\numberline {3}Serveur express}{1}\protected@file@percent }
\@writefile{toc}{\contentsline {section}{\numberline {4}Formulaires}{2}\protected@file@percent }
\gdef\minted@oldcachelist{,
  default-pyg-prefix.pygstyle,
  default.pygstyle,
  A4DB518FFD36C1FFC37C3224D4B3428E949CB2B9A7560AC953C6AD4B2E254B12.pygtex,
  F9944435D755929EF46A8BDA9234D4DC949CB2B9A7560AC953C6AD4B2E254B12.pygtex,
  7D296BB12E13E5AEE1D4FFD190ABA60C5FD97A52CF056AD8310DCD3CDF2A9AFA.pygtex,
  3F6027271ACC288AB54A0697BE78E2035FD97A52CF056AD8310DCD3CDF2A9AFA.pygtex,
  B7C457A84DDFC49D87BAC545C6CB2D2B949CB2B9A7560AC953C6AD4B2E254B12.pygtex}
\@writefile{toc}{\contentsline {section}{\numberline {5}Pour aller plus loin (optionnel)}{3}\protected@file@percent }
