<?xml version="1.0" encoding="UTF-8" standalone="no"?>
<svg
   xmlns:dc="http://purl.org/dc/elements/1.1/"
   xmlns:cc="http://creativecommons.org/ns#"
   xmlns:rdf="http://www.w3.org/1999/02/22-rdf-syntax-ns#"
   xmlns:svg="http://www.w3.org/2000/svg"
   xmlns="http://www.w3.org/2000/svg"
   xmlns:sodipodi="http://sodipodi.sourceforge.net/DTD/sodipodi-0.dtd"
   xmlns:inkscape="http://www.inkscape.org/namespaces/inkscape"
   width="480.91257"
   height="395.64212"
   id="svg2"
   version="1.1"
   inkscape:version="1.0.1 (3bc2e813f5, 2020-09-07)"
   sodipodi:docname="callbacks.svg">
  <defs
     id="defs4">
    <marker
       inkscape:stockid="TriangleOutL"
       orient="auto"
       refY="0"
       refX="0"
       id="TriangleOutL"
       style="overflow:visible">
      <path
         id="path4461"
         d="M 5.77,0 -2.88,5 V -5 Z"
         style="fill-rule:evenodd;stroke:#000000;stroke-width:1pt"
         transform="scale(0.8)"
         inkscape:connector-curvature="0" />
    </marker>
    <marker
       inkscape:stockid="TriangleOutL"
       orient="auto"
       refY="0"
       refX="0"
       id="TriangleOutL-0"
       style="overflow:visible">
      <path
         inkscape:connector-curvature="0"
         id="path4461-4"
         d="M 5.77,0 -2.88,5 V -5 Z"
         style="fill-rule:evenodd;stroke:#000000;stroke-width:1pt"
         transform="scale(0.8)" />
    </marker>
    <marker
       inkscape:stockid="TriangleOutL"
       orient="auto"
       refY="0"
       refX="0"
       id="TriangleOutL-02"
       style="overflow:visible">
      <path
         inkscape:connector-curvature="0"
         id="path4461-0"
         d="M 5.77,0 -2.88,5 V -5 Z"
         style="fill-rule:evenodd;stroke:#000000;stroke-width:1pt"
         transform="scale(0.8)" />
    </marker>
    <marker
       inkscape:stockid="TriangleOutL"
       orient="auto"
       refY="0"
       refX="0"
       id="TriangleOutL-00"
       style="overflow:visible">
      <path
         inkscape:connector-curvature="0"
         id="path4461-1"
         d="M 5.77,0 -2.88,5 V -5 Z"
         style="fill-rule:evenodd;stroke:#000000;stroke-width:1pt"
         transform="scale(0.8)" />
    </marker>
    <marker
       inkscape:stockid="TriangleOutL"
       orient="auto"
       refY="0"
       refX="0"
       id="TriangleOutL-3"
       style="overflow:visible">
      <path
         id="path4461-6"
         d="M 5.77,0 -2.88,5 V -5 Z"
         style="fill-rule:evenodd;stroke:#000000;stroke-width:1pt"
         transform="scale(0.8)"
         inkscape:connector-curvature="0" />
    </marker>
    <marker
       inkscape:stockid="TriangleOutL"
       orient="auto"
       refY="0"
       refX="0"
       id="marker960"
       style="overflow:visible">
      <path
         id="path958"
         d="M 5.77,0 -2.88,5 V -5 Z"
         style="fill-rule:evenodd;stroke:#000000;stroke-width:1pt"
         transform="scale(0.8)"
         inkscape:connector-curvature="0" />
    </marker>
  </defs>
  <sodipodi:namedview
     id="base"
     pagecolor="#ffffff"
     bordercolor="#666666"
     borderopacity="1.0"
     inkscape:pageopacity="0.0"
     inkscape:pageshadow="2"
     inkscape:zoom="1.4"
     inkscape:cx="414.29567"
     inkscape:cy="276.58191"
     inkscape:document-units="px"
     inkscape:current-layer="layer1"
     showgrid="false"
     inkscape:window-width="2560"
     inkscape:window-height="1368"
     inkscape:window-x="0"
     inkscape:window-y="35"
     inkscape:window-maximized="1"
     fit-margin-top="0"
     fit-margin-left="0"
     fit-margin-right="0"
     fit-margin-bottom="0"
     inkscape:document-rotation="0" />
  <metadata
     id="metadata7">
    <rdf:RDF>
      <cc:Work
         rdf:about="">
        <dc:format>image/svg+xml</dc:format>
        <dc:type
           rdf:resource="http://purl.org/dc/dcmitype/StillImage" />
        <dc:title></dc:title>
      </cc:Work>
    </rdf:RDF>
  </metadata>
  <g
     inkscape:label="Layer 1"
     inkscape:groupmode="layer"
     id="layer1"
     transform="translate(295.00995,-214.93753)">
    <path
       inkscape:connector-curvature="0"
       id="path3545-2"
       d="m 16.351708,300.5249 66.505432,-0.49586 v 181.57235 l -63.792506,0.39968"
       style="fill:none;stroke:#000000;stroke-width:2;stroke-linecap:butt;stroke-linejoin:miter;stroke-miterlimit:4;stroke-dasharray:none;stroke-opacity:1;marker-end:url(#TriangleOutL)"
       sodipodi:nodetypes="cccc" />
    <path
       inkscape:connector-curvature="0"
       id="path3545"
       d="m -60.129046,266.64791 c 0,332.56829 0,332.56829 0,332.56829"
       style="fill:none;stroke:#000000;stroke-width:2;stroke-linecap:butt;stroke-linejoin:miter;stroke-miterlimit:4;stroke-dasharray:none;stroke-opacity:1;marker-end:url(#TriangleOutL)" />
    <text
       id="text3152"
       y="230.93362"
       x="-61.110489"
       style="font-style:normal;font-variant:normal;font-weight:normal;font-stretch:normal;line-height:0%;font-family:sans-serif;-inkscape-font-specification:Sans;text-align:center;letter-spacing:0px;word-spacing:0px;writing-mode:lr-tb;text-anchor:middle;fill:#000000;fill-opacity:1;stroke:none"
       xml:space="preserve"><tspan
         y="230.93362"
         x="-61.110489"
         id="tspan3154"
         sodipodi:role="line"
         style="font-size:20px;line-height:1.25;font-family:sans-serif">Interpréteur</tspan><tspan
         id="tspan3156"
         y="255.93362"
         x="-61.110489"
         sodipodi:role="line"
         style="font-size:20px;line-height:1.25;font-family:sans-serif">javascript</tspan></text>
    <rect
       ry="9.2679033"
       rx="9.2679043"
       y="330.75427"
       x="57.699848"
       height="109.39902"
       width="127.20276"
       id="rect2989"
       style="fill:#ff0000;fill-opacity:1;stroke:#000000;stroke-width:2.00001;stroke-miterlimit:4;stroke-dasharray:none;stroke-dashoffset:0" />
    <text
       id="text2985"
       y="379.27121"
       x="120.00829"
       style="font-style:normal;font-variant:normal;font-weight:normal;font-stretch:normal;line-height:0%;font-family:sans-serif;-inkscape-font-specification:Sans;text-align:center;letter-spacing:0px;word-spacing:0px;writing-mode:lr-tb;text-anchor:middle;fill:#000000;fill-opacity:1;stroke:none"
       xml:space="preserve"><tspan
         y="379.27121"
         x="120.00829"
         id="tspan2987"
         sodipodi:role="line"
         style="font-size:20px;line-height:1.25;font-family:sans-serif;text-align:center;text-anchor:middle">traitement</tspan><tspan
         y="404.27121"
         x="120.00829"
         sodipodi:role="line"
         style="font-size:20px;line-height:1.25;font-family:sans-serif;text-align:center;text-anchor:middle"
         id="tspan946">long</tspan></text>
    <rect
       ry="9.2679043"
       rx="9.2679033"
       y="283.55206"
       x="-152.98114"
       height="36.235825"
       width="185.70418"
       id="rect2989-1-9-5"
       style="fill:#37abc8;fill-opacity:1;stroke:#000000;stroke-width:2;stroke-miterlimit:4;stroke-dasharray:none;stroke-dashoffset:0" />
    <text
       id="text2985-8-2-9"
       y="307.36224"
       x="-142.68764"
       style="font-style:normal;font-variant:normal;font-weight:normal;font-stretch:normal;line-height:0%;font-family:sans-serif;-inkscape-font-specification:Sans;text-align:start;letter-spacing:0px;word-spacing:0px;writing-mode:lr-tb;text-anchor:start;fill:#000000;fill-opacity:1;stroke:none"
       xml:space="preserve"><tspan
         y="307.36224"
         x="-142.68764"
         id="tspan2987-9-0-2"
         sodipodi:role="line"
         style="font-size:20px;line-height:1.25;font-family:sans-serif">tâche1(callback)</tspan></text>
    <rect
       ry="9.2679033"
       rx="9.2679033"
       y="464.79071"
       x="-127.2719"
       height="35.714279"
       width="134.28571"
       id="rect2989-1-9-5-9"
       style="fill:#37abc8;fill-opacity:1;stroke:#000000;stroke-width:2;stroke-miterlimit:4;stroke-dasharray:none;stroke-dashoffset:0" />
    <text
       id="text2985-8-2-9-1"
       y="489.07648"
       x="-108.57143"
       style="font-style:normal;font-variant:normal;font-weight:normal;font-stretch:normal;line-height:0%;font-family:sans-serif;-inkscape-font-specification:Sans;text-align:start;letter-spacing:0px;word-spacing:0px;writing-mode:lr-tb;text-anchor:start;fill:#000000;fill-opacity:1;stroke:none"
       xml:space="preserve"><tspan
         y="489.07648"
         x="-108.57143"
         id="tspan2987-9-0-2-7"
         sodipodi:role="line"
         style="font-size:20px;line-height:1.25;font-family:sans-serif">callback()</tspan></text>
    <path
       inkscape:connector-curvature="0"
       id="path3545-2-7"
       d="m -135.92669,354.33149 -66.50543,-0.49586 v 181.57235 l 63.7925,0.39968"
       style="fill:none;stroke:#000000;stroke-width:2;stroke-linecap:butt;stroke-linejoin:miter;stroke-miterlimit:4;stroke-dasharray:none;stroke-opacity:1;marker-end:url(#TriangleOutL-3)"
       sodipodi:nodetypes="cccc" />
    <rect
       ry="9.2679043"
       rx="9.2679033"
       y="336.96957"
       x="-152.98114"
       height="36.235825"
       width="185.70418"
       id="rect2989-1-9-5-0"
       style="fill:#37abc8;fill-opacity:1;stroke:#000000;stroke-width:2;stroke-miterlimit:4;stroke-dasharray:none;stroke-dashoffset:0" />
    <rect
       ry="9.2679033"
       rx="9.2679043"
       y="386.86749"
       x="-294.00995"
       height="109.39902"
       width="127.20276"
       id="rect2989-3"
       style="fill:#ff0000;fill-opacity:1;stroke:#000000;stroke-width:2.00001;stroke-miterlimit:4;stroke-dasharray:none;stroke-dashoffset:0" />
    <text
       id="text2985-5"
       y="433.91931"
       x="-230.27362"
       style="font-style:normal;font-variant:normal;font-weight:normal;font-stretch:normal;line-height:0%;font-family:sans-serif;-inkscape-font-specification:Sans;text-align:center;letter-spacing:0px;word-spacing:0px;writing-mode:lr-tb;text-anchor:middle;fill:#000000;fill-opacity:1;stroke:none"
       xml:space="preserve"><tspan
         y="433.91931"
         x="-230.27362"
         id="tspan2987-6"
         sodipodi:role="line"
         style="font-size:20px;line-height:1.25;font-family:sans-serif;text-align:center;text-anchor:middle">traitement</tspan><tspan
         y="458.91931"
         x="-230.27362"
         sodipodi:role="line"
         style="font-size:20px;line-height:1.25;font-family:sans-serif;text-align:center;text-anchor:middle"
         id="tspan946-2">long</tspan></text>
    <text
       id="text2985-8-2-9-2"
       y="362.76129"
       x="-142.68764"
       style="font-style:normal;font-variant:normal;font-weight:normal;font-stretch:normal;line-height:0%;font-family:sans-serif;-inkscape-font-specification:Sans;text-align:start;letter-spacing:0px;word-spacing:0px;writing-mode:lr-tb;text-anchor:start;fill:#000000;fill-opacity:1;stroke:none"
       xml:space="preserve"><tspan
         y="362.76129"
         x="-142.68764"
         id="tspan2987-9-0-2-70"
         sodipodi:role="line"
         style="font-size:20px;line-height:1.25;font-family:sans-serif">tâche2(callback)</tspan></text>
    <rect
       ry="9.2679033"
       rx="9.2679033"
       y="522.18976"
       x="-127.2719"
       height="35.714279"
       width="134.28571"
       id="rect2989-1-9-5-9-9"
       style="fill:#37abc8;fill-opacity:1;stroke:#000000;stroke-width:2;stroke-miterlimit:4;stroke-dasharray:none;stroke-dashoffset:0" />
    <text
       id="text2985-8-2-9-1-3"
       y="546.47552"
       x="-108.57143"
       style="font-style:normal;font-variant:normal;font-weight:normal;font-stretch:normal;line-height:0%;font-family:sans-serif;-inkscape-font-specification:Sans;text-align:start;letter-spacing:0px;word-spacing:0px;writing-mode:lr-tb;text-anchor:start;fill:#000000;fill-opacity:1;stroke:none"
       xml:space="preserve"><tspan
         y="546.47552"
         x="-108.57143"
         id="tspan2987-9-0-2-7-6"
         sodipodi:role="line"
         style="font-size:20px;line-height:1.25;font-family:sans-serif">callback()</tspan></text>
  </g>
</svg>
