\relax 
\bbl@cs{beforestart}
\catcode `:\active 
\catcode `;\active 
\catcode `!\active 
\catcode `?\active 
\babel@aux{french}{}
\@writefile{toc}{\contentsline {section}{\numberline {1}Introduction}{1}\protected@file@percent }
\@writefile{toc}{\contentsline {section}{\numberline {2}Présentation du site}{1}\protected@file@percent }
\@writefile{toc}{\contentsline {paragraph}{Données.}{1}\protected@file@percent }
\@writefile{toc}{\contentsline {paragraph}{Modèle.}{1}\protected@file@percent }
\@writefile{toc}{\contentsline {paragraph}{Vues.}{1}\protected@file@percent }
\@writefile{toc}{\contentsline {paragraph}{Serveur.}{1}\protected@file@percent }
\@writefile{toc}{\contentsline {section}{\numberline {3}Travail à faire}{2}\protected@file@percent }
\@writefile{toc}{\contentsline {paragraph}{Utiliser Bootstrap}{2}\protected@file@percent }
\@writefile{lof}{\contentsline {figure}{\numberline {1}{\ignorespaces Capture d'écran de la forme attendue pour chacune des vues}}{2}\protected@file@percent }
\@writefile{toc}{\contentsline {subsection}{\numberline {3.1}Barre en haut de page}{2}\protected@file@percent }
\@writefile{toc}{\contentsline {subsection}{\numberline {3.2}Vue de la page principale}{2}\protected@file@percent }
\@writefile{toc}{\contentsline {subsection}{\numberline {3.3}Vue d'une recette}{2}\protected@file@percent }
\@writefile{toc}{\contentsline {subsection}{\numberline {3.4}Vue des résultats de recherche}{2}\protected@file@percent }
