\relax 
\bbl@beforestart
\catcode `:\active 
\catcode `;\active 
\catcode `!\active 
\catcode `?\active 
\babel@aux{french}{}
\@writefile{toc}{\contentsline {section}{\numberline {1}Introduction}{1}\protected@file@percent }
\@writefile{toc}{\contentsline {section}{\numberline {2}Partie 1 : génération de HTML}{1}\protected@file@percent }
\@writefile{toc}{\contentsline {section}{\numberline {3}Partie 2 : Mise en forme}{2}\protected@file@percent }
