\relax 
\bbl@cs{beforestart}
\catcode `:\active 
\catcode `;\active 
\catcode `!\active 
\catcode `?\active 
\babel@aux{french}{}
\@writefile{toc}{\contentsline {section}{\numberline {1}Introduction}{1}\protected@file@percent }
\@writefile{toc}{\contentsline {subsection}{\numberline {1.1}Modélisation de la base de données}{1}\protected@file@percent }
\@writefile{toc}{\contentsline {subsection}{\numberline {1.2}Installation de better-sqlite3}{1}\protected@file@percent }
\gdef\minted@oldcachelist{,
  default-pyg-prefix.pygstyle,
  default.pygstyle,
  82840BC3F006F9285B411571D9767BEB4A2CAD3903177E40E06394B280A39BF2.pygtex}
\@writefile{toc}{\contentsline {subsection}{\numberline {1.3}Implémentation du module {\tt  movies\_sql}}{2}\protected@file@percent }
\@writefile{toc}{\contentsline {subsection}{\numberline {1.4}Intégration dans le site de gestion de films}{2}\protected@file@percent }
