\relax 
\bbl@cs{beforestart}
\catcode `:\active 
\catcode `;\active 
\catcode `!\active 
\catcode `?\active 
\babel@aux{french}{}
\@writefile{toc}{\contentsline {section}{\numberline {1}Introduction}{1}\protected@file@percent }
\@writefile{toc}{\contentsline {section}{\numberline {2}Page}{1}\protected@file@percent }
\@writefile{toc}{\contentsline {section}{\numberline {3}CSS}{1}\protected@file@percent }
\@writefile{toc}{\contentsline {section}{\numberline {4}Échauffement : faire bouger la balle}{2}\protected@file@percent }
\@writefile{toc}{\contentsline {section}{\numberline {5}Faire rebondir la balle}{3}\protected@file@percent }
\@writefile{toc}{\contentsline {section}{\numberline {6}Placement et contrôle des raquettes}{3}\protected@file@percent }
\@writefile{toc}{\contentsline {section}{\numberline {7}Rebondir sur les raquettes}{4}\protected@file@percent }
\@writefile{toc}{\contentsline {section}{\numberline {8}Mettre à jour le score et commencer une autre manche}{4}\protected@file@percent }
