\relax 
\bbl@cs{beforestart}
\catcode `:\active 
\catcode `;\active 
\catcode `!\active 
\catcode `?\active 
\babel@aux{french}{}
\gdef\minted@oldcachelist{,
  default-pyg-prefix.pygstyle,
  default.pygstyle,
  C1E1FFA44F3873F2A42BCAD84979AE72DF986ECD9F09819920ADF61B51D35AF4.pygtex,
  575CC0C2A8CE0CB778EB3D3DD0DEA019DF986ECD9F09819920ADF61B51D35AF4.pygtex}
