\relax 
\bbl@cs{beforestart}
\catcode `:\active 
\catcode `;\active 
\catcode `!\active 
\catcode `?\active 
\babel@aux{french}{}
\@writefile{toc}{\contentsline {section}{\numberline {1}Introduction}{1}\protected@file@percent }
\@writefile{toc}{\contentsline {section}{\numberline {2}Présentation du site}{1}\protected@file@percent }
\@writefile{toc}{\contentsline {paragraph}{Modèle.}{1}\protected@file@percent }
\@writefile{toc}{\contentsline {paragraph}{Vues.}{2}\protected@file@percent }
\@writefile{toc}{\contentsline {paragraph}{Routes.}{2}\protected@file@percent }
\@writefile{toc}{\contentsline {section}{\numberline {3}Travail à faire}{2}\protected@file@percent }
\@writefile{toc}{\contentsline {subsection}{\numberline {3.1}Préparation}{2}\protected@file@percent }
\@writefile{toc}{\contentsline {subsection}{\numberline {3.2}Contrôle d'accès}{3}\protected@file@percent }
\@writefile{toc}{\contentsline {subsection}{\numberline {3.3}Vues conditionnelles}{3}\protected@file@percent }
\@writefile{toc}{\contentsline {subsection}{\numberline {3.4}Authentification}{3}\protected@file@percent }
\gdef\minted@oldcachelist{,
  default-pyg-prefix.pygstyle,
  default.pygstyle,
  EAA8078388D455E7B452E33C87AB3798BEF63E9A02C74DA08FC953093E729E0D.pygtex,
  E3412993F35380169959C1D279DE836368E200A88467055A2335D7955433F392.pygtex,
  5B7B13C7B23AA74006901575641C1E6EBEF63E9A02C74DA08FC953093E729E0D.pygtex,
  96C76918451B670E8696AC85B8EF45EFBEF63E9A02C74DA08FC953093E729E0D.pygtex,
  4C643148380B907A740EC20DAA94137EA0FBE077AB8092CF05F90096CF9766CD.pygtex,
  C1041FA56AFC5CC9C2AB8D238847B068A0FBE077AB8092CF05F90096CF9766CD.pygtex}
\@writefile{toc}{\contentsline {subsection}{\numberline {3.5}Création d'utilisateurs}{4}\protected@file@percent }
\@writefile{toc}{\contentsline {section}{\numberline {4}Pour aller plus loin (optionnel)}{4}\protected@file@percent }
