\relax 
\bbl@beforestart
\catcode `:\active 
\catcode `;\active 
\catcode `!\active 
\catcode `?\active 
\babel@aux{french}{}
\@writefile{toc}{\contentsline {section}{\numberline {1}Contenu}{1}\protected@file@percent }
\@writefile{toc}{\contentsline {section}{\numberline {2}Mise en forme}{1}\protected@file@percent }
\@writefile{toc}{\contentsline {section}{\numberline {3}CV multipages}{1}\protected@file@percent }
